business_x_category.id,business.id,business.ts,business.business_name,business.home_page,business.email_address,business.phone,business.street,business.city,business.state,business.zip_code,business.full_address,business.category,business.rating,business.number_of_reviews,business.bbb_rating_or_license,business.latitude,business.longitude,business.cover_image,business.slogan,business.general_info,business.regular_hours,business.extra_phones,business.services_products,business.payment,business.price_range,business.aka,business.other_links,business.other_information,business.review_1_name,business.review_1_date,business.review_1_rating,business.review_1_text,business.review_2_name,business.review_2_date,business.review_2_rating,business.review_2_text
700112,241467,"2020-09-27 02:53:42","Connecticut Sealcoating",http://www.ctsealcoating.net,amanda@thesambrookgroup.com,"(203) 510-8003","356 Munger Ln",Bethlehem,CT,06751,"356 Munger Ln,Bethlehem,CT 06751","Asphalt Paving & Sealcoating, Asphalt, Driveway Contractors, Parking Lot Maintenance & Marking, Paving Contractors, Road Building Contractors, Snow Removal Service",,,A+,41.65652,-73.2204,https://i3.ypcdn.com/blob/48420b2462e842f21e6962eb1c12cede18dc1b43_100x100_crop.jpg?63f80dd,,,,,,,,,http://www.ctsealcoating.net,,,,,,,,,
700232,241511,"2020-09-27 02:53:42","DeJesus Driveways",http://www.dejesusdriveways.com,josh@dejesusdriveways.com,"(508) 916-1979","1550 Fall River Ave",Seekonk,MA,02771,"1550 Fall River Ave,Seekonk,MA 02771","Asphalt, Driveway Contractors, Parking Lot Maintenance & Marking, Paving Contractors, Sand & Gravel, Snow Removal Service",,,A+,41.78647,-71.31482,,,,"Mon - Sun: 8:00 am - 6:00 pm","Phone: (508) 915-3999",,"all major credit cards",,"DeJesus Driveways LLC",http://www.dejesusdriveways.com,,,,,,,,,
700970,241741,"2020-09-27 02:53:42","Supreme Sealers",,supremesealers@comcast.net,"(203) 234-9553","142 Summer Ln","North Haven",CT,06473,"142 Summer Ln,North Haven,CT 06473","Paving Contractors, Concrete Contractors, Driveway Contractors, General Contractors, Masonry Contractors-Commercial & Industrial, Parking Lot Maintenance & Marking, Snow Removal Service",,,,41.34472,-72.8355,,,,"Mon - Sun: 8:00 am - 8:00 pm","TollFree: (877) 325-6463",,,,"Supreme Sealers Llc Supreme Asphalt Svc",,"Services: Driveways",,,,,,,,
701132,241780,"2020-09-27 02:53:42","Palermo Paving",https://palermopaving.com,palermopaving@verizon.net,"(631) 286-8739","75 Beaver Dam Rd",Bellport,NY,11713,"75 Beaver Dam Rd,Bellport,NY 11713","Paving Contractors, Asphalt Paving & Sealcoating, Concrete Contractors, Drainage Contractors, Driveway Contractors, General Contractors, Masonry Contractors, Masonry Contractors-Commercial & Industrial, Parking Stations & Garages-Construction, Paving Materials, Road Building Contractors, Snow Removal Service",,,A+,40.77345,-72.93945,https://i3.ypcdn.com/blob/c47ab137240d368fe054e4c6b8be3c9d18a35bef_100x100_crop.jpg?63f80dd,,"Trust Palermo Paving contractors to meet all of your asphalt and concrete needs in Bellport, New York. Being a family-owned-and-operated company is an integral part of the way we do business. Each of us has a vested interest in our success, which translates into your paving project and you being handled with service, care, and expertise unmatched in the industry. Company History Michael Palermo began Palermo Paving, Inc. in 1964 as a two-man operation out of his home in East Patchogue, installing all driveways by hand. Over the past 40 years, the company has grown but still upholds the principles upon which it was foundedВ—hard work, honesty and care. The Next Generation Michael M. Palermo passed on his expertise and knowledge of operations to his two sons, Michael John and Jeremy who are now currently running the company. The Palermo Paving of today is a fully automated paving company with operating headquarters in Bellport, NY. Expert Team Our expert team receives ongoing training and certification from our materials producers, allowing us to provide the latest techniques in asphalt and Masonry installation. Since we are locally owned and operated, we understand the normal aging of asphalt in our area and are able to advise in the use of correct materials for your project, aiding in the life, and maintenance.","Mon - Fri: 9:30 am - 5:30 pm Sat - Sun Closed",,,,,,https://palermopaving.com/,"Specialties: Parking Lots, Roads, Walkways, Pathways, Sidewalks Services: Stone Buildings, Driveways",,,,,,,,
701233,241819,"2020-09-27 02:53:42","Corporate Maintenance Group",http://www.corpmg.com,info@corpmg.com,"(410) 309-3300","5850 Waterloo Rd Ste 140",Columbia,MD,21045,"5850 Waterloo Rd Ste 140,Columbia,MD 21045","Parking Lot Maintenance & Marking, Painting Contractors, Snow Removal Service, Sweeping Service-Power",,,A+,39.20835,-76.7997,,,,,"Phone: (310) 867-1549",,,,"Corporate Maintenance Group, LLC","http://www.corpmg.com https://corporateallwash.com",,,,,,,,,
701367,241858,"2020-09-27 02:53:42","Prenosil Concrete",https://prenosilconcrete.com,ckptrp@msn.com,"(515) 442-4962","6125 85th Ln",Indianola,IA,50125,"6125 85th Ln,Indianola,IA 50125","Concrete Restoration, Sealing & Cleaning, Basement Contractors, Building Contractors, Concrete Breaking, Cutting & Sawing, Concrete Contractors, Concrete Equipment & Supplies, Concrete Products, Construction Consultants, Driveway Contractors, Excavation Contractors, General Contractors, Masonry Contractors, Parking Lots & Garages, Patio Builders, Snow Removal Service, Stamped & Decorative Concrete",,,,41.43804,-93.64137,https://i3.ypcdn.com/blob/1537332b28d3b68ff17bdac049d51019abb0b027_100x100_crop.jpg?63f80dd,"40 Years Of Satisfied Customers Because We Take Pride in Our Workmanship","Terry Prenosil Concrete, L.L.C., in Indianola, IA, has offered premium concrete services to the area since 1983, serving Des Moines, West Des Moines, Ankeny and beyond. We offer residential and commercial services for flatwork, basements, driveways, garages, patios, pole barns, shop floors and more. WeВ’re licensed and insured and have more than 40 years of satisfied customers. For all concrete needs, including driveways, basements and patios, call Terry Prenosil Concrete, L.L.C. in Indianola.","Mon - Sat: 8:00 am - 5:00 pm Sun Closed","MobilePhone: (515) 249-0825",,"cash, check",,"Terry Prenosil Concrete, L.L.C.","Primary Website Facebook","Specialties: Slabs, Basements",,,,,,,,
701442,241886,"2020-09-27 02:53:42","Clean Sweep",,cleansweepkpt@centurylink.net,"(423) 817-8172","5917 Stardust Rd",Kingsport,TN,37660,"5917 Stardust Rd,Kingsport,TN 37660","Building Cleaners-Interior, Carpet & Rug Cleaners, Cleaning Contractors, House Cleaning, Industrial Cleaning, Landscaping & Lawn Services, Lawn Maintenance, Parking Lot Maintenance & Marking, Pressure Washing Equipment & Services, Property Maintenance, Snow Removal Service, Truck Washing & Cleaning, Window Cleaning",,,,36.4663,-82.61705,,,,"Mon - Sun: 8:00 am - 5:00 pm",,,"debit, mastercard, all major credit cards, amex, discover, visa",,,,,,,,,,,,
701459,241891,"2020-09-27 02:53:42","MJM Services",http://www.mjmpaving.com,ruthann@mjmpaving.com,"(907) 376-5222",,,,,,"Pavement & Floor Marking Services, Asphalt, Asphalt Paving & Sealcoating, Concrete Contractors, General Contractors, Parking Lot Maintenance & Marking, Paving Contractors, Snow Removal Service",5,"12 Reviews",A+,,,https://i4.ypcdn.com/blob/79ffc9160566149453c84d79b29278dd55e79ba2_100x100_crop.jpg?63f80dd,,"In Alaska, getting from one place to another can be a difficult task. At MJM Services, they understand the importance of their work and pride themselves on giving clients throughout Wasilla and Anchorage reliable paving and sealcoating services for both residential and commercial purposes. From parking lot to driveway paving, these professionals have 25 years of experience and skills that will be put to work for you to provide beautiful asphalt surfaces every time. Customer service is of extreme importance to them, as they keep each client informed of the process throughout every step. They are known for their quality workmanship and precision. They come to each job equipped with the best tools on the market, including tamping machines that pack down the area where the asphalt is placed and large paving machines that can lay large portions of asphalt quickly. If your driveway has seen better days and needs replaced after years of harsh winters, count on this team to provide quick and efficient service. If you arenВ’t looking to replace an entire area, they are also skilled in repair work and will fix any problem they come across, whether it be large cracks or small fissures. They also provide repair work for commercial parking lots, including patching, sealcoating, and striping. Contact the paving specialists at MJM Services today for dedicated service. Call them at (907) 376-5222 to talk with an employee about receiving a free estimate, or visit their website for more information on their services.","Mon - Sun: Open 24 Hours","Phone: (907) 522-5424 Primary Phone: (907) 376-5222",,"all major credit cards",,,website,,"Rod W.",05/04/2016,five,"I have been with MJM Services for years. They offer fair pricing and do outstanding work. I tell people they're the place to go.","Lisa F.",03/04/2016,five,"I have nothing bad to say about the folks from MJM Services. They are all just so great, and reliable. They got here, got to work and got it done."
701557,241912,"2020-09-27 02:53:42","Petty Paving",http://www.pettypaving.com,info@pettypaving.com,"(732) 283-3928","490 State Route 27",Iselin,NJ,08830,"490 State Route 27,Iselin,NJ 08830","Paving Contractors, Asphalt Paving & Sealcoating, Building Contractors, Building Contractors-Commercial & Industrial, Concrete Contractors, Driveway Contractors, Excavation Contractors, General Contractors, Home Builders, Masonry Contractors-Commercial & Industrial, Parking Lot Maintenance & Marking, Pavement & Floor Marking Services, Paving Materials, Snow Removal Service",,,A+,40.5752,-74.31826,https://i3.ypcdn.com/blob/6dc7e9f087502fc27265be3161133a5b255c5ad4_100x100_crop.jpg?63f80dd,,"At Petty Paving, our goal has always been to provide our customers with the highest quality workmanship and service in both commercial and industrial paving. We pride ourselves in our exceptional experience and diversity and also offer repairs and excavation.","Mon - Fri: 7:30 am - 5:00 pm","Phone: (732) 283-1977 Fax: (732) 283-1977",,visa,,"Petty Construction Inc Petty Paving and Construction","http://www.pettypaving.com http://kowbuilders.com","Specialties: Real Estate, Fabrication",,,,,,,,
701566,241915,"2020-09-27 02:53:42","Al's Striping & Sealing",http://www.alsstripingandsealing.com,,"(701) 255-6225","8324 42nd St NE",Bismarck,ND,58503,"8324 42nd St NE,Bismarck,ND 58503","Parking Lot Maintenance & Marking, Concrete Contractors, Snow Removal Service",,,A+,46.8955,-100.72833,,,,,,,,,"AlВ’s Striping & Crack Sealing",http://www.alsstripingandsealing.com,,,,,,,,,
701676,241945,"2020-09-27 02:53:42","Ira' s Tractor Work",,,"(405) 833-3817",,,,,,"Erosion Control, Demolition Contractors, Excavation Contractors, Parking Lot Maintenance & Marking, Snow Removal Service",,,,,,,"Pad Sites, Dirt Work and Snow Removal","Pad Sites, Dirt Work, Snow Removal Brush Hogging, Mowing","Mon - Sun: Open 24 Hours",,,,,,,,,,,,,,,
701896,241990,"2020-09-27 02:53:42","L & S Contractors",,,"(307) 674-1760","138 State Highway 335",Sheridan,WY,82801,"138 State Highway 335,Sheridan,WY 82801","Paving Contractors, Asphalt, Building Contractors-Commercial & Industrial, Home Builders, Parking Lot Maintenance & Marking, Parking Stations & Garages-Construction, Paving Materials, Snow Removal Service",,,,44.70341,-106.97789,,,,,,,,,,,"Specialties: Concrete",,,,,,,,
701966,242011,"2020-09-27 02:53:50","Wilcox Sealing",http://www.wilcoxsealing.com,ryan_wilcox@yahoo.com,"(315) 269-7431","7068 State Route 20",Waterville,NY,13480,"7068 State Route 20,Waterville,NY 13480","Driveway Contractors, Excavation Contractors, Parking Lot Maintenance & Marking, Paving Contractors, Snow Removal Equipment, Snow Removal Service, Waterproofing Contractors",,,A+,42.92134,-75.41962,,,,,"Phone: (315) 841-3355 Phone: (315) 601-9680 Fax: (315) 841-3355",,,,"WILCOX SEALING LLC",http://www.wilcoxsealing.com,,,,,,,,,
702073,242059,"2020-09-27 02:53:50","Black Gold Asphalt & Concrete Paving Co.",http://www.blackgoldconstruction.net,,"(303) 791-8300","12365 Dumont Way",Littleton,CO,80125,"12365 Dumont Way,Littleton,CO 80125","Asphalt, Asphalt Paving & Sealcoating, Concrete Contractors, General Contractors, Parking Lot Maintenance & Marking, Pavement & Floor Marking Services, Paving Contractors, Paving Materials, Snow Removal Service",,,,39.54146,-105.04054,,,,"Mon - Fri: 7:00 am - 5:00 pm","Primary Phone: (719) 453-1777 Phone: (303) 791-8333 Phone: (303) 791-8370 Phone: (719) 694-0444",,amex,,"Black Gold Asphalt and Concrete Paving Black Gold Asphalt & Paving","http://www.blackgoldconstruction.net http://www.sunlandasphalt.com http://blackgoldconstruction.com",,,,,,,,,
702336,242135,"2020-09-27 02:53:50","Gasaway Maintenance Co",http://www.gasawayco.com,,"(630) 378-1616","1290 Lakeside Dr",Romeoville,IL,60446,"1290 Lakeside Dr,Romeoville,IL 60446","Parking Lot Maintenance & Marking, Asphalt Paving & Sealcoating, Concrete Contractors, Driveway Contractors, Excavation Contractors, General Contractors, Home Builders, Painting Contractors, Pavement & Floor Marking Services, Snow Removal Service",,,,41.66542,-88.07302,,,,"Mon - Fri: 8:00 am - 5:00 pm Sat - Sun Closed","Primary Phone: (630) 985-1600 Phone: (630) 323-6500 Phone: (630) 985-1600 Fax: (630) 343-2260",,"mastercard, all major credit cards, amex, discover, visa, debit",,"Gasaway Maintenance Company",http://www.gasawayco.com,"Wheelchair Accessible: Yes",,,,,,,,
702378,242153,"2020-09-27 02:53:50","DPR Contracting",http://www.dprcontracting.com,stjohn2000@hotmail.com,"(509) 654-9044","711 N 51st Ave",Yakima,WA,98908,"711 N 51st Ave,Yakima,WA 98908","Snow Removal Service, Asphalt Paving & Sealcoating, Building Contractors, Building Contractors-Commercial & Industrial, Lighting Contractors, Painting Contractors-Commercial & Industrial, Parking Lot Maintenance & Marking, Parking Stations & Garages-Construction, Paving Contractors",,,,46.60946,-120.5761,,,"DPR Contracting is proud to be serving Yakima and the surrounding communities with professional and reliable services in commercial property maintenance including asphalt paving, line striping, seal coat, curb repair, and parking lot lighting maintenance. In addition we also handle snow removal services. We offer competitive prices and always deliver the highest level of customer satisfaction. Give us a call today to let us help you with your needs!",,,,check,,,http://www.dprcontracting.com,,,,,,,,,
702539,242198,"2020-09-27 02:53:50","Attaboy Striping & Parking Lot Services",http://www.attaboystriping.com,attaboystriping@yahoo.com,"(405) 702-3014","7800 W Hefner Rd","Oklahoma City",OK,73172,"7800 W Hefner Rd,Oklahoma City,OK 73172","Parking Lot Maintenance & Marking, Asphalt, Parking Attendant Service, Parking Lots & Garages, Pavement & Floor Marking Services, Snow Removal Service",,,,35.5797,-97.6449,,,,"Mon - Sun: 8:00 am - 5:00 pm","Toll Free: (877) 453-9155",,,,"Attaboy Striping & Parking Lot Services LLC Attaboy Striping And Parking Lot Services LLC Attaboy Striping And Parking Lot Services",http://www.attaboystriping.com,,,,,,,,,
702735,242253,"2020-09-27 02:53:50","Spodeck Inc",http://spodeckcontracting.com,,"(906) 249-1546","6884 Us Highway 41 S",Marquette,MI,49855,"6884 Us Highway 41 S,Marquette,MI 49855","Snow Removal Service, Lawn Maintenance, Parking Lot Maintenance & Marking",,,,46.43595,-87.27916,,,,"Mon - Fri: 9:00 am - 5:00 pm","Phone: (906) 249-3997 Fax: (906) 249-3997",,"amex, master card, visa",,"Spodeck Contracting",http://spodeckcontracting.com,,,,,,,,,
702835,242274,"2020-09-27 02:53:50","AAA Asphalt LLC",http://www.aaaasphaltllc.com,aaaasphaltllc@aol.com,"(262) 679-1850",,,,,,"Paving Contractors, Asphalt, Asphalt Paving & Sealcoating, Driveway Contractors, Parking Lot Maintenance & Marking, Road Building Contractors, Snow Removal Service",,,,,,,,,,,,,,,http://www.aaaasphaltllc.com,,,,,,,,,
703160,242373,"2020-09-27 02:53:50","Arrow Maintenance",http://www.arrowstonecreations.com,,"(540) 639-0724","3081 Radford Rd",Christiansburg,VA,24073,"3081 Radford Rd,Christiansburg,VA 24073","Parking Lot Maintenance & Marking, Concrete Contractors, Pavement & Floor Marking Services, Paving Contractors, Snow Removal Service",,,,37.12963,-80.49831,,,,,"Phone: (540) 639-4673 Fax: (540) 639-4673",,,,,http://www.arrowstonecreations.com,,,,,,,,,
703397,242449,"2020-09-27 02:53:50","Bouma Brothers Landscape",http://www.boumabrothers.com,inquire@boumabrothers.com,"(616) 878-9524","4107 82nd St SW","Byron Center",MI,49315,"4107 82nd St SW,Byron Center,MI 49315","Excavation Contractors, Building Contractors, General Contractors, Grading Contractors, Landscape Contractors, Parking Lot Maintenance & Marking, Septic Tanks & Systems, Sewer Contractors, Snow Removal Service, Utility Contractors",,,A+,42.81615,-85.76549,,"Your Total Landscape Solution","We at Bouma Brothers provide superior service in both landscaping and excavating service both to residential as well as commercial businesses. Bouma Brothers Landscape, Inc. is one of West Michigan s premier landscape companies. We are proud to provide landscape design solutions for both homes and businesses. Bouma Brothers Excavating is a family owned company founded on integrity, commitment, and hard work and is one of Michigan s fastest growing excavating companies. Bouma Brothers Excavating is an experienced and well equipped company capable of handling any size and scope of project. Quality, performance and professionalism are what give Bouma Brothers a decided advantage. Services: Landscape Design and Construction Patio and Sidewalk Design and Construction Driveway Design and Construction, Natural Steps, Water Features, Retaining Wall Design and Construction, Landscape Lighting, Interior Landscaping, Custom Fire Pits, Lawn Preparation, Hydro Seeding and Sod, Lawn Care an d Maintenance, Pruning and Fertilization, Bark and Stone, Snow Plowing & Removal and Ice Management, Underground Sprinkling",,"Phone: (616) 878-3878 Fax: (616) 878-3878",,"visa, mastercard",,"ouma Brothers Landscape Maintenance, Inc. Bouma Brothers Excavating Inc Bouma Brothers Landscape & Excavating Inc Bouma Brothers Excavating & Landscape Inc",http://www.boumabrothers.com,"Services: Lawn Maintenance, Septic Tanks",,,,,,,,
703412,242456,"2020-09-27 02:53:50","Eastern Asphalt Co",http://www.easternasphalt.com,,"(810) 787-5500","G5172 N Dort Hwy",Flint,MI,48505,"G5172 N Dort Hwy,Flint,MI 48505","Parking Lot Maintenance & Marking, Asphalt Paving & Sealcoating, Building Contractors, Driveway Contractors, Parking Stations & Garages-Construction, Paving Contractors, Snow Removal Service",,,,43.08044,-83.67267,,,"Pre-Qualified MDOT Paving Contractor Since 1972","Mon - Fri: 8:00 am - 5:00 pm",,,,,"Eastern Asphalt Co, Inc.",http://www.easternasphalt.com,"Services: Driveways",,,,,,,,
703652,242521,"2020-09-27 02:53:50","Regent Corp",http://www.regentpaving.com,,"(716) 481-2887","3839 Walden Ave",Lancaster,NY,14086,"3839 Walden Ave,Lancaster,NY 14086","Paving Contractors, Drainage Contractors, Excavation Contractors, Parking Lot Maintenance & Marking, Septic Tanks & Systems, Snow Removal Service",,,A+,42.91797,-78.6571,,,,"Mon - Fri: 8:30 am - 5:30 pm Sat: 9:00 am - 4:30 pm",,,,,"Regent Paving Corporation",http://www.regentpaving.com,,,,,,,,,
703731,242551,"2020-09-27 02:53:50","A&S Asphalt Sealing",http://www.asasphaltsealingllc.webs.com,,"(717) 273-6182",,Lebanon,PA,17042,"Lebanon,PA 17042","Parking Lot Maintenance & Marking, Asphalt Paving & Sealcoating, Paving Contractors, Snow Removal Service",,,,,,,,,,,,,,,http://www.asasphaltsealingllc.webs.com,,,,,,,,,
703825,242586,"2020-09-27 02:53:50","Patriot Driveway Inc.",https://patriotdriveway.com,patriotdriveway@gmail.com,"(413) 446-7981","814 East St",Pittsfield,MA,01201,"814 East St,Pittsfield,MA 01201","Asphalt, Asphalt Paving & Sealcoating, Concrete Contractors, General Contractors, Parking Lot Maintenance & Marking, Paving Contractors, Paving Materials, Snow Removal Service",,,A+,42.45006,-73.23646,,,"Look no further than Patriot Driveway Inc. when you need commercial or residential paving services in the Pittsfield, MA area! (413) 446-7981","Mon - Sat: 7:00 am - 5:00 pm Sun Closed",,,,,,http://patriotdriveway.com,,,,,,,,,
704075,242646,"2020-09-27 02:53:50","DeMatteo SealCoating",http://www.dematteo-sealcoating.com,,"(412) 464-0187",,,,,,"Asphalt Paving & Sealcoating, Driveway Contractors, Parking Lot Maintenance & Marking, Snow Removal Service",,,,,,,"We Cut Prices Without Cutting Corners","At DeMatteo SealCoating, Inc., customer satisfaction is our primary concern. Whether you have a 100,000 sq. ft. parking lot, or a single-car driveway, you can be assured we will always provide you with the same quality products. We give all our customers an excellent coating at a competitive price. This is why more that 70 percent of our projects in a single season are from repeat customers.The services we provide include* Commercial Asphalt Paving and Sealcoating* Parking Lot Line Striping and Maintenance * Residential Driveways * Crackfilling* Minor Concrete work","Mon - Fri: 7:00 am - 5:00 pm Sat - Sun Closed",,,,,,http://www.dematteo-sealcoating.com,,,,,,,,,
704083,242650,"2020-09-27 02:53:50","S H Striping Stephen Hipfl",,,"(620) 235-0664","506 Wilson St",Frontenac,KS,66763,"506 Wilson St,Frontenac,KS 66763","Parking Lot Maintenance & Marking, Snow Removal Service",,,,37.44879,-94.69021,,,,,,,,,"S H Striping Stephen Hippl Sh Striping",,"Services: Patio & Deck Cleaning & Restoration",,,,,,,,
704102,242656,"2020-09-27 02:53:50","American Sweeping Services",,americansweepin@aol.com,"(208) 362-3272","6655 W Victory Rd",Boise,ID,83709,"6655 W Victory Rd,Boise,ID 83709","Pavement & Floor Marking Services, Asphalt, Asphalt Paving & Sealcoating, Parking Lot Maintenance & Marking, Snow Removal Service, Sweeping Service-Power",,,A+,43.57502,-116.26456,,,,,"Phone: (208) 995-9400",,,,"American Sweeping Services LLC",,,,,,,,,,
704155,242678,"2020-09-27 02:53:50","Renaissance Asphalt Services",https://qualityasphaltutah.com,renaissance-services@live.com,"(801) 244-1363","6170 S 380 W Ste 200","Salt Lake City",UT,84107,"6170 S 380 W Ste 200,Salt Lake City,UT 84107","Asphalt, Asphalt Paving & Sealcoating, Concrete Contractors, Parking Lot Maintenance & Marking, Pavement & Floor Marking Services, Snow Removal Service",,,A+,40.63756,-111.90208,,,,"Mon - Fri: 7:00 am - 6:00 pm","Phone: (385) 388-4857 Primary Phone: (385) 388-4857",,"all major credit cards",,"Renaissance Services",https://qualityasphaltutah.com,,,,,,,,,