business_x_category.id,business.id,business.ts,business.business_name,business.home_page,business.email_address,business.phone,business.street,business.city,business.state,business.zip_code,business.full_address,business.category,business.rating,business.number_of_reviews,business.bbb_rating_or_license,business.latitude,business.longitude,business.cover_image,business.slogan,business.general_info,business.regular_hours,business.extra_phones,business.services_products,business.payment,business.price_range,business.aka,business.other_links,business.other_information,business.review_1_name,business.review_1_date,business.review_1_rating,business.review_1_text,business.review_2_name,business.review_2_date,business.review_2_rating,business.review_2_text
267231,87737,"2020-09-27 02:38:25","Caribou Inn & Convention Center",http://www.caribouinn.com,ksimmon1@maine.rr.com,"(207) 498-3733","19 Main St",Caribou,ME,04736,"19 Main St,Caribou,ME 04736","Convention Services & Facilities, Bridal Shops, Business Coaches & Consultants, Business Management, Health Clubs, Health Resorts, Hotels, Lodging, Motels, Night Clubs, Restaurants, Wedding Supplies & Services",,,A+,46.81476,-67.99754,https://i2.ypcdn.com/blob/f1983d9327aaf3288a7ac29216ec55d63e3f4bfd_100x100_crop.jpg?e66d351,"Northern Maines Premier Hotel Accomodations","The Caribou Inn & Convention Center, Aroostook County?s finest full-service hotel & conference facility, is conveniently located just three miles south of the city of Caribou, ?The Hub of the County.? Caribou, known for its picturesque rolling hills and scenic farm lands, is centrally located near many of the County?s beautiful lakes, rivers, and streams. Being in the ?Hub of the County? makes the Caribou Inn the perfect destination for vacationers and business travelers alike. We are located just 9.2 miles from Presque Isle, Maine (Aroostook County?s largest city), home to Northern Maine Regional Airport, Aroostook Centre Mall, University of Maine at Presque Isle, The Aroostook Medical Center, and just 10.8 miles from the Loring Commerce Centre, DFAS, and Maine Military Authority. In addition, Fort Kent and Madawaska are just an hour?s travel away, means that the Caribou Inn & Convention Center not only the hotel of choice, but also for convenience. Nestled between the Aroostook River, scenic potato fields, and an abundance of wildlife, we offer the perfect setting for a peaceful & relaxing stay The ITS trail system, providing perfectly-groomed winter trails, comes right to our back yard, making the Caribou Inn & Convention Center convenient for snowmobiling enthusiasts as well. The Caribou Inn & Convention Center offers 72 newly remodeled, comfortable guest rooms & executive suites. We offer all the modern conveniences, with complimentary high-speed wireless internet access throughout our facility, an indoor heated pool and hot tub, restaurant, bar, and extensive conference and meeting facilities. Our Conference Center can accommodate everything from intimate gatherings, interactive meetings to large-scale events & exhibitions. The Caribou Inn & Convention Center is home to The Greenhouse Restaurant , the finest dining experience in Northern Maine. In addition, Albie?s Lounge is a comfortable cocktail bar offering a quiet place to relax, socialize and unwind","Mon - Sun: Open 24 Hours",,,"master card, visa, carte blanche, debit, discover, amex",,,http://www.caribouinn.com,"Wi-Fi: Free Parking: Lot Specialties: Fitness, Conventions, Banquets, Black Tie, Conferences, Indoors, Restaurants, Convention Centers, Banquet Facilities, Company Meetings, Copiers, Business Meetings, Homes, Meeting Facilities, Buffets, Accommodations, Grand Openings, Formal Price Range : Average",,,,,,,,
318224,105710,"2020-09-27 02:40:22","America's Best Inn & Suites",,abis508@yahoo.com,"(863) 682-0303","508 E Memorial Blvd",Lakeland,FL,33801,"508 E Memorial Blvd,Lakeland,FL 33801","Motels, Bed & Breakfast & Inns, Bus Lines, Car Rental, Corporate Lodging, Historical Places, Hotels-Apartment, Lodging, Restaurants, Stadiums, Arenas & Athletic Fields","2,5","2 Reviews",A+,28.05553,-81.95291,,,"Welcome to Americas Best Inn And Suites, your Lakeland В“home away from home.В” Americas Best Inn And Suites aims to make your visit as relaxing and enjoyable as possible, which is why so many guests continue to come back year after year. While staying at Holiday Palm Hotel, visitors can check out Lake Mirror Historic Tour (0.8 mi) and Joker Marchant Stadium (1.3 mi), some of Lakeland's top attractions. Holiday Palm Hotel offers guests an array of room amenities including air conditioning and a refrigerator, and getting online is possible, as free wifi is available. The motel offers a 24 hour front desk, to make your visit even more pleasant. The property also features a pool and an on-site restaurant. Guests arriving by vehicle have access to free parking. If you like Mexican restaurants, Americas Best Inn And Suites is conveniently located near Tapatio's Restaurant Mexicano, Mega Mercado, and La Michoacana Mexican Restaurant. Should time allow, Hollis Garden, Lake Mirror, and Munn Park are some popular attractions that are within walking distance. Americas Best Inn And Suites puts the best of Lakeland at your fingertips, making your stay both relaxing and enjoyable.","Mon - Sun: Open 24 Hours","Phone: (863) 683-0800 Fax: (863) 683-0800",,"visa, discover, mastercard, all major credit cards",,,,"Parking: Lot Wheelchair Accessible: Yes","Sam P.",03/25/2016,four,"At America's Best Inn & Suites, we are committed to providing fair quality lodging and excellent customer service to Lakeland, Fl and its surrounding area","Keith S.",03/19/2016,one,"The one star is a stretch. Started off by getting an estimate for a one week stay. That was honored at check in but 3 days later was told the price was wrong and had to come up with an additional $59 in the next 30 minutes or we would be removed from our room and refunded a fraction if what we paid. Then there's the ongoing rate increases by the hour. Checkout/checking time is 11am if you call to let them know you want to stay another night you are quoted a price, great let's stay another night right? In the time it takes to walk to the front desk that price has jumped about 20$ higher. When you inquire about the quote the manager Sam gets nasty almost combatative and asks you to pay it or leave. This is the same owner that has been seen smoking drugs in the rooms of some of his employees. Yet is quick to deny a person because "" they look like a certain type of person. The rooms are borderline slum worthy and while unpacking I went to hide a few valuables under my bed only to finf"
374913,124931,"2020-09-27 02:42:20","Treehouse Point",http://www.treehousepoint.com,info@treehousepoint.com,"(425) 441-8087","6922 Preston Fall City Rd SE",Issaquah,WA,98027,"6922 Preston Fall City Rd SE,Issaquah,WA 98027","Lodging, Bed & Breakfast & Inns, Massage Services, Motels, Yoga Instruction",,,,47.53835,-121.91038,https://i1.ypcdn.com/blob/0e7d59037310f875885f0cd1b095daa1f7130ee9_100x100_crop.jpg?f832250,,"A unique bed and breakfast in tree houses located intimately within natures woods. Also a great place for weddings and retreats with nearby hiking trails farmer's markets and more.","Mon - Fri: 9:00 am - 12:00 pm","Phone: (425) 441-4016 Primary Phone: (425) 441-4016 TollFree: (800) 272-5474",,"debit, all major credit cards",,"Treehouse Point Pond Room",http://www.treehousepoint.com,"Wi-Fi: Free",,,,,,,,
397458,134358,"2020-09-27 02:43:24","Continental Inn",http://www.marathonresort.com,relax@marathonresort.com,"(800) 443-7352","1121 W Ocean Dr","Key Colony Beach",FL,33051,"1121 W Ocean Dr,Key Colony Beach,FL 33051","Hotels, Condominiums, Lodging, Motels, Resorts",,,,24.71719,-81.0236,https://i3.ypcdn.com/blob/2741005328e11dfa9ec8cb09b59d0a5ac7edb8f7_100x100_crop.jpg?d9a04b5,,"Everyone needs a place to lay their weary head. For travelers visiting Key Colony Beach, Continental Inn is an excellent choice for rest and rejuvenation. Well-known for its family-friendly environment and proximity to great restaurants, Continental Inn makes it easy to enjoy the best of Key Colony Beach. The rooms offer a flat screen TV, a kitchenette, and a refrigerator, and getting online is possible, as free wifi is available, allowing you to rest and refresh with ease. In addition, as a valued Continental Hotel guest, you can enjoy a pool that is available on-site. Guests arriving by vehicle have access to free parking. While visiting Key Colony Beach, you may want to try some ribs at one of the nearby restaurants, such as Key Colony Inn. Continental Inn is sure to make your visit to Key Colony Beach one worth remembering.","Mon - Sun: 9:00 am - 5:00 pm","Phone: (305) 289-0101",,"discover, amex, all major credit cards",,,http://www.marathonresort.com,"Parking: Lot Wi-Fi: Free Price Range : Average",,,,,,,,
398661,134824,"2020-09-27 02:43:24","Glacier Ridge Suites",http://www.glacierridgesuites.com,info@glacierridgesuites.com,"(406) 752-4333","281 1st Ave W N",Kalispell,MT,59901,"281 1st Ave W N,Kalispell,MT 59901","Corporate Lodging, Cabins & Chalets, Condominiums, Hotels, Lodging, Motels",,,,48.20251,-114.31635,https://i4.ypcdn.com/blob/19df293d19bd2381645b4ed11c85d72febea3f6c_100x100_crop.jpg?41e4770,,"Great Kalispell location, close to downtown and in the center of all of the areas' featured attractions. Housekeeping is included. Furnished luxury Suite in very clean immaculate condition, equipped kitchen (includes all cookware, dishes, glasses, silverware etc.), ready to move-in. Includes high-speed internet, phone, cable TV (movie channels), housekeeping and all utilities. Serious inquires- phone calls only. No lease to sign, one price everything included. Call Kent 406-250-28 zero nine or email me your phone number and I will call you.","Mon - Sun: Open 24 Hours",,,"amex, discover, mastercard",,,http://www.glacierridgesuites.com,,,,,,,,,
400009,135340,"2020-09-27 02:43:25","Skyland Lodge",http://www.skylandlodge.com,paul@skylandlodge.com,"(970) 349-7541","350 Country Club Dr Unit 111","Crested Butte",CO,81224,"350 Country Club Dr Unit 111,Crested Butte,CO 81224","Motels, Condominiums, Hotels",,,,38.86374,-106.94685,,"Affordable hotel style lodging.","The Skyland Lodge features hotel style rooms with a private balcony and a kitchenette. Each kitchenette includes a microwave, small refrigerator, coffee maker, toaster and kitchen sink. Skyland Lodge also has a meeting room available to its guests. Other amenities include hot tub and coin operated laundry facilities. Skyland Lodge is a cozy and quiet place to spend your Vacation! Winters are great for downhill skiing and snowboarding at Crested Butte Resort. You may also enjoy great backcountry skiing, snowmobiling, nordic skiing! Stay in the summer and golf, fish, mountain bike, hike and enjoy the scenic Colorado Rocky Mountains! Skyland Lodge Current Specials: Seniors save 10% on Lodging. Stay four nights at regular price and get a fifth night for free! Please check back for winter skiing specials. Make a reservation by calling:OR email.","Mon - Sun: 6:00 am - 11:00 pm","Fax: (970) 349-7548 TollFree: (800) 428-3770",,"cash, check, debit, discover, amex, visa, mastercard",,,http://www.skylandlodge.com,,,,,,,,,
404016,136931,"2020-09-27 02:43:32","Moonspinner Condominium",http://www.moonspinner.com,generalmanager@moonspinner.com,"(850) 234-8900","4425 Thomas Dr","Panama City",FL,32408,"4425 Thomas Dr,Panama City,FL 32408","Hotels, Condominiums, Lodging, Motels, Real Estate Agents, Real Estate Rental Service, Resorts",,,A+,30.13486,-85.74556,,"A Location 2nd to None","A new tradition for your family Your search is over for the best vacation destination on Panama City Beach. Moonspinner Condominiums, where the beach and nature meet, located adjacent to St. Andrews State Park. We offer 24-hour security, two lighted PREMIER Tennis courts, heated pool, kiddie pool and hot tub, exercise room, basketball, shuffleboard, FREE local, long distance and FREE WIFI in every room. Our seasonal beach service offers dolphin tours, wave runners, parasail rides, and beach chair rentals. If you enjoy fishing, hiking, bicycling or just being part of nature, the St. Andrews State Park is the way to go. Nestled on the quiet end of the beach, you are only minutes away from fine dining, marinas and boat launching just to name a few. Let us make a new tradition for your family. Call or book on line today!","Mon - Sat: 8:00 am - 5:00 pm Sun: 7:30 am - 5:00 pm","Toll Free: (800) 233-3947",,"visa, master card, debit, cash, travelers checks",,,"Moonspinner Web Site","Parking: Lot Wi-Fi: Free Price Range : Average",,,,,,,,
404231,137009,"2020-09-27 02:43:35","The OC Studio Suites",http://www.theocstudiosuites.com,,"(603) 926-2488","703 Ocean Blvd",Hampton,NH,03842,"703 Ocean Blvd,Hampton,NH 03842","Hotels, Condominiums, Lodging, Motels",,,,42.92685,-70.79904,,,"All our rooms feature a Queen size bed, full size pull out sofa,cable TV, Wi-Fi,a mini fridge, wet bar, microwave & full private bath. There is one parking space per room. All of the suites have ocean front balconies. Please be advised that our building has a strict no smoking, no pet policy. Rates are based upon double occupancy, additional adults are $20.00 per person with a maximum of four people per room. Children stay free. The lower rates are for suites on our lower floors, higher rates are for suites on the higher floors. We are located about 1 1/2 mile north of the Club Casino, directly across the street from Hampton's North Beach.","Mon - Sun: 10:00 am - 5:00 pm","Phone: (603) 758-6325 Fax: (603) 758-6325 TollFree: (866) 582-4855",,"all major credit cards, cash, check, debit",,"O C Suites","http://www.theocstudiosuites.com https://www.theocstudiosuites.com","Parking: Lot Price Range : Average",,,,,,,,
404361,137061,"2020-09-27 02:43:35","Blowin N The Wind Management",http://www.basicmgt.com,,"(850) 234-0349","8730 Thomas Dr Ste 1101","Panama City",FL,32408,"8730 Thomas Dr Ste 1101,Panama City,FL 32408","Vacation Homes Rentals & Sales, Condominiums, Motels",,,,30.16882,-85.78882,,,,"Mon - Sun: Open 24 Hours","TollFree: (800) 874-8600",,"check, debit, discover, amex, all major credit cards",,,http://www.basicmgt.com,,,,,,,,,
405473,137514,"2020-09-27 02:43:35","Avista Resort",https://www.avistaresort.com,info@avistaresort.com,"(843) 249-2521","300 N Ocean Blvd","North Myrtle Beach",SC,29582,"300 N Ocean Blvd,North Myrtle Beach,SC 29582","Resorts, Condominium Management, Condominiums, Hotels, Lodging, Motels, Vacation Homes Rentals & Sales",,,,33.82014,-78.66827,https://i4.ypcdn.com/blob/be9205db4b2567f076b6789291ce5c8d5e74dc3c_100x100_crop.jpg?41e4770,,"Located oceanfront, in the heart of North Myrtle Beach's iconic Ocean Drive area, Avista Resort offers breathtaking beachfront views of the Atlantic coastline. Modern and inviting condominium accommodations are designed with comfort and convenience in mind for couples, families, and groups. Our pristine shoreline and many indoor and outdoor pools, hot tubs, and lazy rivers are a favorite of families. Our on-site restaurant, Just Off Main, and the separate Tree Top Lounge, offer satisfying dining and drink options for all.","Mon - Sun: Open 24 Hours","Fax: (843) 417-1061 TollFree: (800) 968-8986",,"visa, mastercard, amex, discover, cash",,,"Primary Website","Wi-Fi: Free Parking: Garage, Lot Swimming Pool: Seasonal, Indoor, Children's Pool, Outdoor, Poolside Bar Property Amenities: Picnic area, Breakfast available (surcharge), Elevator/lift, Designated smoking areas, Fitness facilities, Designated smoking areas (fines apply), Safe-deposit box at front desk, Spa tub, Porter/bellhop, Conference center, Laundry facilities, Bar/lounge, Front desk (limited hours), 24-hour business center, Pool sun loungers, 24-hour front desk, Restaurant, ATM/banking, Concierge services, Wedding services, Lazy river, Conference space, Tours/ticket assistance",,,,,,,,
405884,137663,"2020-09-27 02:43:35","PCB Holiday Hotels, Inns, Condos & Resorts",https://holiday.vacation-rentals-pcb.com,,"(850) 696-7940","11002 Front Beach Rd","Panama City Beach",FL,32407,"11002 Front Beach Rd,Panama City Beach,FL 32407","Hotels, Condominiums, Motels, Resorts, Travel Agencies",,,,30.18193,-85.81563,,,,"Mon - Sun: Open 24 Hours","TollFree: (800) 400-4172",,"amex, discover, diners club, visa, mastercard",,,"Primary Website",,,,,,,,,
407909,138430,"2020-09-27 02:43:46","Anchorage Uptown Suites",http://www.anchorageuptownsuites.com/,uptownsuites@gci.net,"(907) 279-4232","234 E 2nd Ave",Anchorage,AK,99501,"234 E 2nd Ave,Anchorage,AK 99501","Condominiums, Corporate Lodging, Hotels, Lodging, Motels, Vacation Homes Rentals & Sales",,,,61.22018,-149.87987,,"""Your Home Away From Home""","eluxe standards at a reasonable price Anchorage Uptown Suites offers a vast array of discount possibilities. Business, military, government, airline, senior, group and Alaskan residents all find that staying in a hotel with us is affordable. Our extended-stay hotel beats our competitor's rates 99% of the time. This, coupled with our easy location, is perfect for any traveler to Alaska, be they a first-timer or a regular visitor. Also, be sure to visit our friends at Alaska Adventure Suites in Ninilchik, Alaska!","Mon - Sun: 7:00 am - 12:00 pm","Fax: (907) 279-4231 TollFree: (800) 478-4232",,"master card, visa, cash, amex",,,http://www.anchorageuptownsuites.com,,,,,,,,,
408789,138787,"2020-09-27 02:43:46","El Constante Condominiums",http://www.elconstante.com,accommodations@elconstante.com,"(361) 949-7088","14802 Windward Dr","Corpus Christi",TX,78418,"14802 Windward Dr,Corpus Christi,TX 78418","Hotels, Condominiums, Lodging, Motels, Resorts",,,,27.6098,-97.2075,,,,"Mon - Sun: 9:00 am - 9:00 pm",,,"visa, master card, amex, discover",,,http://www.elconstante.com,"Parking: Lot, Free Wi-Fi: No Wheelchair Accessible: Yes",,,,,,,,
409086,138904,"2020-09-27 02:43:46","Pointe Royale Vacation Rentals",http://www.pointeroyale.com,info@pointeroyale.com,"(417) 334-5614","158 Pointe Royale Dr. Ste 100",Branson,MO,65616,"158 Pointe Royale Dr. Ste 100,Branson,MO 65616","Vacation Homes Rentals & Sales, Condominium Management, Condominiums, Hotels, Lodging, Motels, Real Estate Management, Real Estate Rental Service, Resorts",,,,36.60316,-93.2904,,,,"Mon - Thu: 8:00 am - 8:00 pm Fri - Sat: 8:00 am - 9:00 pm Sun: 8:00 am - 6:00 pm","Phone: (417) 334-1696 Phone: (417) 334-5623 TollFree: (800) 962-4710",,"all major credit cards",,"Point Royale Vacation Rentals Pointe Royale Nightly Condo Rentals Pointe Royale Nightly Condo",http://www.pointeroyale.com,,,,,,,,,
409424,139034,"2020-09-27 02:43:51","Little Creek Cove",,lcc@littlecreekcove.com,"(541) 265-8587","3641 NW Oceanview Dr",Newport,OR,97365,"3641 NW Oceanview Dr,Newport,OR 97365","Hotels, Bed & Breakfast & Inns, Condominiums, Lodging, Motels, Resorts",,,,44.66347,-124.05664,https://i4.ypcdn.com/blob/fadb41bb48b58b183dc8211f4fdcf17d7d5f865c_100x100_crop.jpg?41e4770,,"Property Location With a stay at Little Creek Cove in Newport, you'll be on the beach and minutes from Agate Beach Golf Course, and close to Agate Beach Neighborhood and Dog Park. This beach condo is within close proximity of Yaquina Head Light House and Don Davis Memorial Park. Rooms Treat yourself to a stay in one of the 31 individually decorated guestrooms, featuring fireplaces and LED televisions. Rooms have private furnished balconies. Kitchens are outfitted with full-sized refrigerators/freezers, stovetops, and microwaves. Cable programming and DVD players are provided for your entertainment, while complimentary wireless Internet access keeps you connected. Amenities Take in the views from a garden and make use of amenities such as complimentary wireless Internet access and barbecue grills. Getting to nearby attractions is a breeze with the area shuttle (surcharge). Business, Other Amenities The front desk is staffed during limited hours. Free self parking is available onsite.","Mon - Sun: 8:00 am - 8:00 pm","Phone: (541) 265-4576 Fax: (541) 265-4576 Fax Number: (541) 265-4576 TollFree: (800) 294-8025",,"master card, visa, amex, discover, all major credit cards, diners club",,,,"Parking: Lot Wi-Fi: Free Price Range : Average Check-In Time: 4 PM Check-Out Time: noon Property Amenities: Designated smoking areas, Garden, Barbecue grill(s), Beach towels, Area shuttle (surcharge), Front desk (limited hours) Room Amenities: Daily housekeeping, Yard, Shower/tub combination, Dishwasher, Fireplace, Hair dryer, Phone, Full-sized refrigerator/freezer, Separate dining area, Furnished balcony, Cookware, dishware, and utensils, Kitchen, Iron/ironing board, Cable TV service, Access via exterior corridors, Free local calls, Separate living room, LED TV, Coffee/tea maker, Stovetop, Private bathroom (not in room), Blackout drapes/curtains, Microwave, Individually decorated, Individually furnished, DVD player, Premium TV channels Pets Allowed: No",,,,,,,,
411917,140053,"2020-09-27 02:43:56","Grande Shores Ocean Resort",https://www.grandeshores.com,,"(843) 692-2397","201 77th Ave N","Myrtle Beach",SC,29572,"201 77th Ave N,Myrtle Beach,SC 29572","Hotels, Condominiums, Lodging, Motels, Resorts, Vacation Homes Rentals & Sales",,,A+,33.74377,-78.81401,https://i3.ypcdn.com/blob/f7211d51a1830035399f30d11a155dc163d3c067_100x100_crop.jpg?d9a04b5,,"Grande Shores Ocean Resort is nestled along one of the most desirable sections of the Atlantic Ocean coastline in Myrtle Beach. Enjoy affordable condominium and hotel accommodations just minutes from major attractions and the heart of Myrtle Beach, but feel like you are miles from the hustle and bustle. Adjacent to a wooded residential area, Grande Shores offers unmatched serenity and stunning oceanfront views of the shoreline. Indoor and outdoor pools, hot tubs, and lazy rivers are fun for the entire family. Our grassy beachfront lawn offers an intimate setting for weddings. Our on-site restaurant and bar, Shoreline Caf?, is popular with families and couples.","Mon - Sun: Open 24 Hours","TollFree: (877) 798-4074",,"amex, discover, visa, mastercard, cash",,,"Primary Website","Parking: Lot Wi-Fi: Free Swimming Pool: Seasonal, Indoor, Children's Pool, Outdoor, Poolside Bar Check-In Time: 4 PM Check-Out Time: 11 AM Property Amenities: Picnic area, Breakfast available (surcharge), Elevator/lift, Fitness facilities, Safe-deposit box at front desk, Porter/bellhop, Laundry facilities, Bar/lounge, 24-hour business center, Pool sun loungers, 24-hour front desk, Restaurant, ATM/banking, Meeting rooms, Lazy river, Conference space, Tours/ticket assistance Room Amenities: Daily housekeeping, Shower/tub combination, Private bathroom, Phone, Hair dryer, Premium bedding, Air conditioning, Refrigerator, Separate dining area, Microwave, Full-sized refrigerator/freezer, Flat-panel TV, Cookware, dishware, and utensils, Furnished balcony, Sofa bed size, Kitchen, Iron/ironing board, Access via exterior corridors, Cable TV service, Free local calls, Separate sitting area, Connecting/adjoining rooms available, Sofa bed, Coffee/tea maker, DVD player, Stovetop",,,,,,,,
411975,140080,"2020-09-27 02:43:56","Front Beach Budget Rentals",http://frontbeach.vacation-rentals-pcb.com,,"(850) 565-1129","11002 Front Beach Rd","Panama City Beach",FL,32407,"11002 Front Beach Rd,Panama City Beach,FL 32407","Hotels, Condominiums, Motels, Resorts, Travel Agencies",,,,30.18183,-85.81546,https://i4.ypcdn.com/blob/3664359000dbeebcf203fed51f3875ad11972d48_100x100_crop.jpg?41e4770,,,"Mon - Sun: Open 24 Hours",,,"amex, discover, diners club, visa, master card",,,http://frontbeach.vacation-rentals-pcb.com,,,,,,,,,