business_x_category.id,business.id,business.ts,business.business_name,business.home_page,business.email_address,business.phone,business.street,business.city,business.state,business.zip_code,business.full_address,business.category,business.rating,business.number_of_reviews,business.bbb_rating_or_license,business.latitude,business.longitude,business.cover_image,business.slogan,business.general_info,business.regular_hours,business.extra_phones,business.services_products,business.payment,business.price_range,business.aka,business.other_links,business.other_information,business.review_1_name,business.review_1_date,business.review_1_rating,business.review_1_text,business.review_2_name,business.review_2_date,business.review_2_rating,business.review_2_text
919810,304440,"2020-09-27 03:00:22","Cuisine By Celine",http://cuisinebyceline.com,celine@cuisinebyceline.com,"(480) 628-7258",,Scottsdale,AZ,85259,"Scottsdale,AZ 85259","Personal Chefs, Caterers, Caterers Equipment & Supplies, French Restaurants, Nutritionists",,,,,,https://i2.ypcdn.com/blob/a46e9ded9692895a4e5aa775dfd9f53f3a526dfe_100x100_crop.jpg?8ad0f92,,,,,,"cash, discover, master card, visa, all major credit cards",,,http://cuisinebyceline.com,,,,,,,,,
2147571,666665,"2020-09-27 03:36:24","Ms. Gilmore's Tea Room & Vintage Suitcase",http://msgilmores.com/,robingilmore60@gmail.com,"(417) 866-7000","211 E Commercial St",Springfield,MO,65803,"211 E Commercial St,Springfield,MO 65803","Antiques, Bakeries, Clothing Stores, Coffee & Tea, Delicatessens, French Restaurants, General Merchandise, Health Food Restaurants, Restaurants, Sandwich Shops, Tea Rooms, Vegetarian Restaurants",,,A,37.22985,-93.29157,,,,"Mon - Sat: 10:00 am - 5:00 pm",,,"mastercard, discover",,,"http://msgilmores.com http://robinsvintagesuitcase.com","Cuisines: Tea Room By Appointment Only: No Attire: Casual Parking: Lot",,,,,,,,
2685110,833239,"2020-09-27 03:52:47","Apple Wellington Green",http://www.apple.com/retail/wellingtongreen?cid=aos-us-seo-maps,wellingtongreen@apple.com,"(561) 273-2940","10300 Forest Hill Blvd",Wellington,FL,33414,"10300 Forest Hill Blvd,Wellington,FL 33414","French Restaurants, Caterers, Meeting & Event Planning Services, Restaurants",5,"3 Reviews",,26.65049,-80.20912,https://i2.ypcdn.com/blob/dccfc191beb2f6bb3c01714b3a07ea37b9e44a28_100x100_crop.jpg?f9d23e1,,"Visit the Apple Store to shop for Mac, iPhone, iPad, Apple Watch, and more. Sign up for Today at Apple programs. Or get support at the Genius Bar.","Mon - Sat: 10:00 am - 9:00 pm Sun: 11:00 am - 6:00 pm",,,"all major credit cards, debit, amex, discover, mastercard, visa",,,http://www.apple.com/retail/wellingtongreen,,yasescobar,10/25/2012,five,"try the everything they are soooo sooo good.",yasescobar,10/25/2012,five,
3069326,957664,"2020-09-27 04:03:37",Everest,http://www.everestrestaurant.com,everest@leye.com,"(312) 663-8920","425 S Financial Pl",Chicago,IL,60605,"425 S Financial Pl,Chicago,IL 60605","Restaurants, Colleges & Universities, French Restaurants",,,,41.87656,-87.633,https://i2.ypcdn.com/blob/f48a2550fbd6fa53f88eeb25e278de1bfea04895_100x100_crop.jpg?e66d351,,"One of the country's premier dining rooms, Everest is located on the 40th floor of the Chicago Stock Exchange. Chef/proprietor J. Joho's world-renowned cuisine and award-winning wine list have earned Everest international recognition.","Tue - Thu: 5:30 pm - 9:00 pm Fri: 5:30 pm - 9:30 pm Sat: 5:00 pm - 10:00 pm",,,"mastercard, amex, diners club, discover, visa",,"Everest Room",http://www.everestrestaurant.com,"Parking: Valet Wi-Fi: No Bike Parking: Yes Good For Family: Yes Good For Groups: Yes Wheelchair Accessible: Yes Cuisines: French, European, Continental Alcohol: No, Full Bar, Wine Takes Reservations: Yes Outdoor Seating: No Price Range : Above Average Good for Kids: Yes",,,,,,,,
3285738,1067713,"2020-09-27 04:14:19","crepe du jour",https://www.crepedujour.cafe,anthony@crepedujour.com,"(864) 520-2882","20 S Main St",Greenville,SC,29601,"20 S Main St,Greenville,SC 29601","Liquor Stores, Bars, Beverages, Breakfast, Brunch & Lunch Restaurants, Coffee & Tea, Coffee Shops, Family Style Restaurants, Fine Dining Restaurants, French Restaurants, Restaurants, Wine, Wine Bars",,,,34.85025,-82.39958,https://i2.ypcdn.com/blob/9643e07ce7ccec4e110a35032e1c34f46906bfa7_100x100_crop.jpg?f9d23e1,"Crpes, Coffee, Wine, Cocktails And More","Come enjoy an authentic French crperie experience where we serve a variety of sweet and savory crpes, specialty coffee, cocktails, craft beer, and wine! So many delicious choices, serving breakfast, lunch, and dinner, you will find it difficult to decide which crpe to choose at each visit. Try our customer favorites: a savory Chicken and Mushroom Crpe or our sweet Main Street Crpe filled with almond cream cheese mousse and topped off with strawberry coulis. Are you a coffee lover? We serve the exceptional Counter Culture Coffee. Try one of our Specialty Coffees such as the Borgia or the Caf Melange. Stop by to taste some of our counter culture coffee, a variety of french wines, specialty cocktails, and craft beer.","Mon Closed Tue - Thu: 8:00 am - 10:00 pm Fri - Sat: 8:00 am - 11:00 pm Sun: 8:00 am - 9:00 pm",,,"amex, cash, check, discover, master card, visa",,,https://www.crepedujour.cafe,,,,,,,,,
3289608,1069902,"2020-09-27 04:14:26","Escape Restaurant Bar",https://www.escaperestaurant.com,,"(904) 801-3899","1023 Park St.",Jacksonville,FL,32204,"1023 Park St.,Jacksonville,FL 32204","Restaurants, Asian Restaurants, Banquet Halls & Reception Facilities, Bars, Beer & Ale, Breakfast, Brunch & Lunch Restaurants, Caterers, Cocktail Lounges, Dessert Restaurants, Filipino Restaurants, French Restaurants, Hamburgers & Hot Dogs, Hookah Bars, Liquor Stores, Mediterranean Restaurants, Pizza, Sandwich Shops, Seafood Restaurants, Steak Houses, Vegan Restaurants, Wine",,,,30.31489,-81.68059,https://i2.ypcdn.com/blob/8ca2da663425f34a95c22f0039f37dbce5f3e716_100x100_crop.jpg?f9d23e1,"Taste Your Way Around The World Without Leaving 5 Points",,"Mon Closed Tue - Wed: 11:00 am - 10:00 pm Thu: 11:00 am - 12:00 am Fri - Sat Closed, 11:00 am - 12:00 am Sun Closed, 11:00 am - 10:00 pm","MobilePhone: (727) 766-5769",,"visa, mastercard, amex, discover, cash",,,"Primary Website Facebook Instagram Twitter",,,,,,,,,
3300010,1075632,"2020-09-27 04:15:06","Joy Bistro",http://www.joybistroboone.com,joybistroboone@gmail.com,"(828) 265-0500","115 New Market Ctr",Boone,NC,28607,"115 New Market Ctr,Boone,NC 28607","Restaurants, American Restaurants, Caterers, Fine Dining Restaurants, French Restaurants, Italian Restaurants, Liquor Stores, Restaurant Menus, Wine",,,,36.21868,-81.66327,,"Purveyors of Fine Food & Drink","great food!","Mon Closed Tue - Thu: 5:30 pm - 8:30 pm Fri - Sat: 5:30 pm - 9:00 pm Sun: 5:30 pm - 8:00 pm",,,"all major credit cards",,,http://www.joybistroboone.com,"Parking: Lot, Private Wi-Fi: No Attire: Dressy Cuisines: Fine Dining, Caterers, American, French, Italian, European, Continental Alcohol: Full Bar Bike Parking: Yes Takes Reservations: Yes Outdoor Seating: Yes",,,,,,,,
3312577,1082635,"2020-09-27 04:15:53",Balaban's,http://www.balabanswine.com,info@balabanswine.com,"(636) 449-6700","1772 Clarkson Rd",Chesterfield,MO,63017,"1772 Clarkson Rd,Chesterfield,MO 63017","Bars, Banquet Halls & Reception Facilities, Bar & Grills, Caterers, French Restaurants, Liquor Stores, Restaurants, Seafood Restaurants, Taverns, Wine, Wine Bars","3,5","8 Reviews",A+,38.64136,-90.56781,,,"Balaban's is widely acclaimed both for its fine dining and its outstanding wine list. At Balaban's we relish the wine and food so our customers remember the experience. Renewing and refining the original Cafe Balaban's style and flair, the flavors of France, Spain and Italy weave through the contemporary American menu at Balaban's. Unlike most restaurants, which often charge a substantial markup for the privilege of enjoying wine service in their dining rooms, Balaban's allows patrons to choose from from it's over 860 different wines, including its celebrated Library Wine Collection, consisting of over 250 wines now maturing after up to 25 years, and enjoy any of those wines at retail price plus a mere $8 corkage fee.","Mon - Thu: 10:00 am - 9:00 pm Fri - Sat: 10:00 am - 10:30 pm Sun: 10:00 am - 2:00 pm","Fax: (636) 449-6720",,"amex, discover, master card, visa",,"Balaban's - Chesterfield",http://www.balabanswine.com,"Parking: Lot, Private Wi-Fi: Free Bike Parking: No Attire: Casual Wheelchair Accessible: Yes Takes Reservations: Yes Outdoor Seating: Yes Price Range : Average",PHmind,12/08/2009,five,"I had a great night out. Awesome service, good food nice atmosphere. We had a great time, shared a wonderful bottle of wine and had about 6 courses of tapas that were out of this world. Way to come back Balaban's!",geowei,03/08/2009,four,"I've been here a couple of times. Sat in the bistro once, the tables just outside the main dining room. The menu there is a little less than the dining room and it was less impressive. But had a great meal in the dining room and will definitely return. Many classic American dishes, well done, if a bit pricey. But a good place to go for a special meal."
3332526,1094027,"2020-09-27 04:17:05","Il Mercato Cafe & Wine Shop",https://www.ilmercatocafe.com,info@ilmercatocafe.net,"(954) 457-3700","1454 E Hallandale Beach Blvd","Hallandale Beach",FL,33009,"1454 E Hallandale Beach Blvd,Hallandale Beach,FL 33009","Liquor Stores, American Restaurants, Bars, Fine Dining Restaurants, French Restaurants, German Restaurants, Italian Restaurants, Restaurants, Wine, Wine Bars",,,,25.9857,-80.13292,https://i1.ypcdn.com/blob/f9132f9f10533a976c8a23a80067f1a9164b0599_100x100_crop.jpg?f9d23e1,,"Who are we? We are the third generation of restaurant owners going all the way back to an Italian immigrant in post-war Germany. Our food is both Italian and German, but there are French influences as well.","Mon Closed Tue - Sun: 5:30 pm - 10:30 pm","Phone: (954) 993-3782",,"visa, all major credit cards",,,https://www.ilmercatocafe.com,"Parking: Lot, Private Wi-Fi: Free Bike Parking: Yes Attire: Casual Wheelchair Accessible: Yes Cuisines: French, Italian, European, German, Continental Alcohol: Beer, Wine Takes Reservations: Yes Outdoor Seating: Yes Price Range : Average",,,,,,,,
3341307,1099153,"2020-09-27 04:17:29","French Lick Vintage Caf and Winery",http://www.frenchlickwinery.com,wineclub@oliverwinery.com,"(812) 936-2293","8145 W Sinclair St","West Baden Springs",IN,47469,"8145 W Sinclair St,West Baden Springs,IN 47469","French Restaurants, Beverages, Coffee & Tea-Wholesale & Manufacturers, Gift Shops, Italian Restaurants, Liquor Stores, Pizza, Restaurants, Wine, Wine Bars, Wineries",,,,38.56257,-86.61099,,,"The French Lick winery features award winning wines, wine tasting, tours, and an Italian restaurant. One mile from the French Lick Casino and historic West Baden Springs","Mon Closed Tue - Thu: 11:00 am - 5:00 pm Fri - Sat: 11:00 am - 9:00 pm Sun: 11:00 am - 5:00 pm",,,"amex, discover, master card, visa, debit, check",,,"http://www.frenchlickwinery.com https://frenchlickwinery.com","Parking: Lot, Private Bike Parking: Yes Cuisines: French, Italian, European, Continental, Pizza, Wine Bars By Appointment Only: No Price Range : Average",,,,,,,,
5083993,1519544,"2020-09-27 04:57:47","The Cheese Steak Shop",,berkeley@cheesesteakshop.com,"(510) 845-8689","1054 University Ave",Berkeley,CA,94710,"1054 University Ave,Berkeley,CA 94710","Steak Houses, American Restaurants, French Restaurants, Restaurants, Sandwich Shops, Take Out Restaurants","3,5","2 Reviews",,37.86864,-122.293,https://i1.ypcdn.com/blob/6ba2717926ad8a00f7fe3f6f68be0b651107cfd2_100x100_crop.jpg?f832250,,,"Mon - Sun: 11:00 am - 9:00 pm","Phone: (510) 845-8465 Primary Phone: (510) 356-4179 Phone: (510) 356-4179 Fax: (510) 845-8465",,"discover, amex, mastercard, visa",,"Cheese Steak Shop Incorporated Cheese Steak Shop Inc",,"Parking: Street, Lot, Private Wi-Fi: No Bike Parking: Yes Attire: Casual Good For Groups: Yes Good for Kids: Yes Wheelchair Accessible: Yes Take Out: Yes Cuisines: American, Sandwiches, French, Take Out, Steakhouse, European, Continental Alcohol: No Takes Reservations: No Outdoor Seating: No Price Range : Below Average",jafarhie,01/21/2008,three,"I tried The Cheesesteak Shop after hearing rave reviews. While their Cheesesteaks are delicious the portions are very small and a bit over priced. They even charge $1.00 extra for peppers. Great taste but overpriced.",sydthekyd,07/24/2002,four,"Hot out of the fryer, big chunky fries that don't get greasy plus they leave the delcious, nutritious skins on - they're great and worth ordering on their own."
5084771,1519677,"2020-09-27 04:57:47","Morgan's in the Desert",http://www.wellmax.com,,"(760) 564-7600","49499 Eisenhower Dr","La Quinta",CA,92253,"49499 Eisenhower Dr,La Quinta,CA 92253","American Restaurants, Continental Restaurants, French Restaurants, Restaurants, Steak Houses",,,,33.68797,-116.31032,https://i1.ypcdn.com/blob/8e318bb3a43001651ae756dead12fd83d7c697c8_100x100_crop.jpg?f832250,,"MorganВ’s in the desert is La QuintaВ’s signature dining venue showcasing contemporary American cuisine inspired by the bounty of the Coachella Valley. The restaurantВ’s local focus includes sourcing the top of the regionВ’s products, crafted with traditional cooking methods to offer deliciously simple and healthful dishes. Join us at the piano bar, in the dining room or on the fire-lit courtyard. Gather round.","Mon: 6:00 am - 10:00 pm Tue - Wed Closed Thu - Sun: 6:00 am - 10:00 pm","Phone: (760) 564-4111 Phone: (760) 564-7656 Phone: (760) 564-5729 Primary Phone: (760) 564-5729",,"discover, mastercard",,"MorganВ’s in the desert","http://www.wellmax.com http://www.morgansinthedesert.com","Parking: Valet Wi-Fi: Free Bike Parking: Yes Attire: Dressy Wheelchair Accessible: Yes Cuisines: American, French, Steakhouse, European, Continental Alcohol: Full Bar Takes Reservations: Yes Outdoor Seating: Yes",,,,,,,,
5085405,1519798,"2020-09-27 04:57:47","La Vue",http://www.lavueny.com,info@lavueny.com,"(718) 513-6004","3202 Emmons Ave",Brooklyn,NY,11235,"3202 Emmons Ave,Brooklyn,NY 11235","Continental Restaurants, American Restaurants, Bars, Caterers, Family Style Restaurants, French Restaurants, Restaurants, Seafood Restaurants, Steak Houses",,,,40.58395,-73.93277,https://i1.ypcdn.com/blob/f12c796fbd9d5e520bd31defcef378499765b771_100x100_crop.jpg?f832250,,"La Vue restaurant is fueled with the desire to entertain & satisfy all by providing an aesthetically impressive ambiance & fine dining.","Mon - Thu: 2:00 pm - 11:00 pm Fri - Sat: 1:00 pm - 4:00 am Sun: 12:00 pm - 12:00 am","Phone: (908) 862-0404",,"cash, amex, discover, master card, visa, all major credit cards",,"La VUE Restaurant & Lounge La Vue Russian Restaurant La Vue Restaurant",http://www.lavueny.com,"Parking: Valet Wi-Fi: Free Bike Parking: No Attire: Dressy Good For Groups: Yes Good for Kids: Yes Take Out: Yes Alcohol: Full Bar Cuisines: Caterers, Family Style, American, French, Steakhouse, European, Seafood, Continental Takes Reservations: Yes Outdoor Seating: Yes",,,,,,,,
5085863,1519886,"2020-09-27 04:57:47","Frank's Steaks",http://www.frankssteaks.com,,"(516) 536-1500","54 Lincoln Ave","Rockville Centre",NY,11570,"54 Lincoln Ave,Rockville Centre,NY 11570","Steak Houses, American Restaurants, Caterers, French Restaurants, Restaurants",,,,40.65514,-73.64798,https://i1.ypcdn.com/blob/c5850ecfcd87e750d51a7803a6f62edc3fd897e4_100x100_crop.jpg?f832250,,,"Mon - Fri: 11:30 am - 12:00 am Sat: 4:00 am - 11:00 am Sun: 4:00 am - 9:00 am","Phone: (516) 536-8812 Fax: (516) 536-8812",,"visa, amex, discover, master card, all major credit cards, paypal",,"Frank's Steaks - Rockville Centre","http://www.frankssteaks.com https://frankssteaks.com/welcome http://www.frankssteaks.com/locations","Parking: Valet Wi-Fi: Free Bike Parking: Yes Attire: Casual Wheelchair Accessible: Yes Cuisines: Caterers, American, French, Steakhouse, European, Continental Alcohol: Full Bar Takes Reservations: Yes Outdoor Seating: No",,,,,,,,
5087323,1520134,"2020-09-27 04:57:48","Glatt Ala Carte",http://www.glattalacarte.com,sales@glattalacarte.com,"(718) 438-6675","5123 18th Ave",Brooklyn,NY,11204,"5123 18th Ave,Brooklyn,NY 11204","Steak Houses, American Restaurants, Asian Restaurants, Caterers, Continental Restaurants, French Restaurants, Hamburgers & Hot Dogs, Italian Restaurants, Japanese Restaurants, Mexican Restaurants, Restaurants, Seafood Restaurants, Sushi Bars, Take Out Restaurants",,,,40.62661,-73.98248,https://i1.ypcdn.com/blob/f8117bc9da0d1e7fbbf0ca7196fa694158a194b8_100x100_crop.jpg?f832250,,,"Mon - Thu: 1:00 pm - 10:00 pm Fri - Sat Closed Sun: 1:00 pm - 10:00 pm",,,"discover, all major credit cards, amex, visa, cash, master card",,,"http://www.glattalacarte.com http://www.nyglatt.com https://glattalacarte.com","Parking: Street, Valet Wi-Fi: Free Bike Parking: No Attire: Casual Good For Groups: Yes Good for Kids: Yes Wheelchair Accessible: Yes Take Out: Yes Cuisines: Japanese, Burgers, Caterers, Mexican, American, French, Latin American, European, Steakhouse, Continental, Asian, Take Out, Hot Dogs, Sushi, Italian, Seafood Alcohol: Beer, Wine Takes Reservations: Yes Outdoor Seating: No",,,,,,,,
5087363,1520139,"2020-09-27 04:57:48","Sonny Lubick Steakhouse",http://www.sonnylubicksteakhouse.com,info@sonnylubicksteakhouse.com,"(970) 484-9200","115 S College Ave","Fort Collins",CO,80524,"115 S College Ave,Fort Collins,CO 80524","Steak Houses, American Restaurants, Barbecue Restaurants, Bars, Caterers, French Restaurants, Hamburgers & Hot Dogs, Restaurants, Seafood Restaurants",5,"1 Review",A+,40.58663,-105.0775,https://i3.ypcdn.com/blob/1e4fb8de8c3e192d527d653e30753001b96820b0_100x100_crop.jpg?f832250,,,"Mon - Thu: 4:00 pm - 10:00 pm Fri - Sat: 4:00 pm - 11:30 pm Sun: 4:00 am - 9:00 pm",,,"discover, master card, all major credit cards, amex, visa",,,"http://www.sonnylubicksteakhouse.com http://www.sonnylubicksteakhouse.com/default.aspx","Parking: Street Wi-Fi: No Bike Parking: Yes Attire: Dressy Good For Groups: Yes Good for Kids: No Wheelchair Accessible: No Take Out: No Cuisines: Burgers, Caterers, Barbecue, American, French, Hot Dogs, Steakhouse, European, Seafood, Continental Alcohol: Yes, Full Bar Takes Reservations: Yes Outdoor Seating: No","Vanessa P.",08/20/2017,five,"Waiters and waitresses were friendly and great atmosphere. Love dessert! So heavenly! recommend go there!",,,,
5087407,1520147,"2020-09-27 04:57:48","Capitol Chophouse",http://www.capitolchophouse.com,hiltonmadison.info@hiltonmadison.com,"(608) 255-0165","9 E Wilson St",Madison,WI,53703,"9 E Wilson St,Madison,WI 53703","Steak Houses, American Restaurants, Banquet Halls & Reception Facilities, Barbecue Restaurants, Bars, Caterers, French Restaurants, Restaurants, Seafood Restaurants","3,5","2 Reviews",,43.07269,-89.38041,,,"The Capitol ChopHouse serves lunch and dinner, featuring the best steak and seafood in Madison. The award winning ChopHouse uses 28 day aged beef and line caught seafood to create a dining experience not to be forgotten.","Mon - Fri: 11:30 am - 2:00 pm Sat - Sun: 10:00 am - 2:00 pm",,,"all major credit cards, amex, debit, discover",,,"http://www.capitolchophouse.com http://www.chophouse411.com","Parking: Garage, Validated, Valet Wi-Fi: Free Bike Parking: No Attire: Dressy Wheelchair Accessible: Yes Cuisines: Caterers, Barbecue, American, French, Steakhouse, European, Seafood, Continental Alcohol: Full Bar Takes Reservations: Yes Outdoor Seating: Yes Pets Allowed: No",rtrigo,09/12/2011,two,"We went to this place strictly because it was close to my job. I went for the Friday Fish Fry, which almost everybody has one in Madison on Fridays, and the fish was horrible. You are only given a selection of catfish or perch. The catfish is fried or blackened. My order was messed up so they served me blackened catfish that was rubbery and had the worst tasting curry flavor. Once it was fixed I was given the fried catfish which was tasteless. The fries were crunchy but it was hardly worth the wait since the service was terrible. I will never go back to this place and if this is what upscale Madison looks like....then I'll go to the food cart around the block next time.",berndogg_02,11/14/2007,five,"good food but expect to pay a bit more since it is a steak house. Overall I would rate it pretty high."
5087644,1520189,"2020-09-27 04:57:48","Jax Cafe",http://www.jaxcafe.com,,"(612) 789-7297","1928 University Ave NE",Minneapolis,MN,55418,"1928 University Ave NE,Minneapolis,MN 55418","American Restaurants, Banquet Halls & Reception Facilities, Bars, Breakfast, Brunch & Lunch Restaurants, Caterers, Continental Restaurants, Family Style Restaurants, Fine Dining Restaurants, French Restaurants, Night Clubs, Restaurants, Seafood Restaurants, Steak Houses",4,"38 Reviews",A+,45.00777,-93.263115,,,,"Mon Closed Tue - Thu: 11:00 am - 9:30 pm Fri - Sat: 11:00 am - 10:00 pm Sun: 11:00 am - 9:00 pm","Phone: (612) 789-0138 Fax: (612) 789-0138",,"mastercard, discover, visa, amex",,,"http://www.jaxcafe.com http://jaxcafe.com/indexm.php","Cuisines: Fine Dining, Caterers, Family Style, American, French, Breakfast, Brunch & Lunch, Steakhouse, European, Seafood, Continental Wi-Fi: Free Wheelchair Accessible: Yes Alcohol: Full Bar Parking: Street, Lot, Private Bike Parking: Yes Attire: Dressy Good For Family: Yes Good For Groups: Yes Takes Reservations: Yes Outdoor Seating: Yes Good for Kids: Yes",PatSh,02/03/2012,one,"don't waste your money here. Not sure why anyone would go here. It's old, dirty and the food is bland and very bad. Our steak was way overcooked and when we mentioned it the server just said, """"oh, too bad."""". Unbelievable!! Maybe she had been working there for too many years to know what customer service is. Our drinks were never refilled. Then we found a hair in our potatos and told the owner, who did Nothing! What a joke! I would never spend a penny in this place again...plus it's way overpriced!!!",amt103,11/11/2010,four,"After all these years, Jax is still a very special place. Love the food, good wine list, top-shelf liquor selection. Can be pricey, but worthwhile for a special occassion."
5087735,1520201,"2020-09-27 04:57:48","Fuel Wilmette",http://www.fuelwilmette.com,,"(847) 251-3835","1222 Washington Ct",Wilmette,IL,60091,"1222 Washington Ct,Wilmette,IL 60091","American Restaurants, Barbecue Restaurants, Breakfast, Brunch & Lunch Restaurants, Caterers, French Restaurants, Health Food Restaurants, Irish Restaurants, Italian Restaurants, Mediterranean Restaurants, Restaurants, Sandwich Shops, Seafood Restaurants, Steak Houses, Vegan Restaurants, Vegetarian Restaurants",,,,42.07806,-87.70905,,,"It's a from farm to table restaurant. Delicious!!","Mon - Fri: 6:00 am - 2:00 pm Sat - Sun: 7:00 am - 2:00 pm",,,"visa, discover, master card, all major credit cards, amex",,"Breakfast Fuel Breakfast Fuel Llc","http://www.fuelwilmette.com http://fuelwilmette.com/farm-to-table","Cuisines: Caterers, Barbecue, French, American, Steakhouse, Healthy, European, Vegetarian, Vegan, Continental, Mediterranean, Sandwiches, Breakfast, Brunch & Lunch, Irish, Italian, Seafood Wheelchair Accessible: Yes Alcohol: Beer, Wine Parking: Street Bike Parking: Yes Attire: Casual Takes Reservations: Yes Outdoor Seating: Yes",,,,,,,,