business_x_category.id,business.id,business.ts,business.business_name,business.home_page,business.email_address,business.phone,business.street,business.city,business.state,business.zip_code,business.full_address,business.category,business.rating,business.number_of_reviews,business.bbb_rating_or_license,business.latitude,business.longitude,business.cover_image,business.slogan,business.general_info,business.regular_hours,business.extra_phones,business.services_products,business.payment,business.price_range,business.aka,business.other_links,business.other_information,business.review_1_name,business.review_1_date,business.review_1_rating,business.review_1_text,business.review_2_name,business.review_2_date,business.review_2_rating,business.review_2_text
78044,33760,"2020-09-27 02:33:01","Fontaine Estates Winery",,fontaineestates@live.com,"(509) 972-8123","151 Rowe Hill Dr",Naches,WA,98937,"151 Rowe Hill Dr,Naches,WA 98937","Ballrooms, Dance Halls, Wine, Wineries",,,A+,46.69308,-120.64277,,,"Fontaine Estates resides in 1920's apple packing house in the most diverse agricultural area in Washington State, the Yakima Valley. Fontaine Estates offers unsurpassed views of the Upper Yakima Valley as well as providing indoor and outdoor facilities for any type of occasion. The winery has been kept as orginal as possible boasting open-beam ceiling and original wood floors.",,,,"all major credit cards, amex, carte blanche, check, company card, debit, diners club, discover, jcb, master card, visa",,,,,,,,,,,,
250869,82515,"2020-09-27 02:37:40","NAPA KETTLE INC",http://www.facebook.com/napakettle,,"(916) 764-3663","1215 K St Ste 1700",Sacramento,CA,95814,"1215 K St Ste 1700,Sacramento,CA 95814","Mail-Order Fulfillment Service, Art Goods, Art Supplies, Arts & Crafts Supplies, Beer Dispensing & Cooling Equipment, Beer Homebrewing Equipment & Supplies, Beverage Coolers, Bridal Registries, Bridal Shops, Cake Decorating Equipment & Supplies, Caterers Equipment & Supplies, Children's Party Planning & Entertainment, China, Crystal & Glassware, Chinaware & Glassware-Renting, Coffee & Tea, Coffee Brewing Devices, Cookies & Crackers, Cookware & Utensils, Decoration Supply, Decorative Ceramic Products, Etched Products-Metal, Glass, Etc, Food & Beverage Consultants, Food Products, Games & Supplies, Gift Baskets, Gift Shops, Gift Wrapping Materials, Glassware, Glassware Decorators, Gourmet Shops, Greeting Cards, Holiday Lights & Decorations, Interior Decorators & Designers Supplies, Kitchen Accessories, Meeting & Event Planning Services, News Service, Online & Mail Order Shopping, Paper & Plastic Cups, Containers & Utensils, Party & Event Planners, Party Favors, Supplies & Services, Party Planning, Patio & Outdoor Furniture, Picnic Grounds, Silverware, Straws-Drinking, Tea Rooms, Wedding Supplies & Services, Wine Bars, Wine Brokers, Wineries, Winery Equipment & Supplies",5,"1 Review",,38.57847,-121.48988,https://i2.ypcdn.com/blob/89ec1fd8f1b3b873437b8ed911da3fb54ef6cd0a_100x100_crop.jpg?e66d351,"Escape Ordinary! Make Your Mark in Modern Rustic Elegance by Napa Kettle","Hello! How are you dining?&#10.Escape Ordinary! Make Your Mark with Modern, Rustic Elegance by Napa Kettle&#10.&#10.Like us on http://facebook.com/napakettle for you chance to win any number of ongoing goodies&#10.&#10.Keep your guests talking long after your soiree is over. Napa Kettle is a family of local artisan &amp. specialty shops. Partnering with the best future-driven artists at the very best pricing, we take the stress out of entertaining and gift giving all year round. We pride ourselves on Exquisite Service and carefully curating unique quality For Your Home life and Office environment! We carry cutting-edge Housewares, Kitchenware&.s, Coffee &amp. Tea products, Premium Wine Accessories, Craft Beer Products, Gourmet,Picnic Basket, Good Reads, Fun for the whole family. We have abundant free guides for entertaining and travel. &#10.&#10.By customizing our products with names or business logos give you the pleasure of becoming the artist and taking your gifts to another level.&#10.&#10.Napa Kettle Sells its products through select catalogs, events and retail throughout the United States. Internet and direct operations are comprised of websites and mail order catalogs We also have business to business sales and sales to corporate customers and the hospitality industry designed to feature displays of abundant premium fair trade products.&#10.&#10.Are you a Downton Abbey Fan? Do you consider yoursel a Holiday Gourmet? Shop our Exclusive Collections Now.Collections&#10.&#10.We are a Military Family, Minority and Women Owned Business","Sat - Sun: 11:00 am - 5:00 pm Appointment Only Hours Mon - Fri 11:00 am - 5:00 pm",,,"all major credit cards, cash, paypal, visa, financing available",,,"http://www.facebook.com/napakettle http://www.stumbleupon.com/stumbler/napakettle",,"Dr C.",11/16/2015,five,"I wont go into too much detail. But I will be a life long fan of Napa Kettle. I was ordering a few quick items for dinner party gifts... glasses that stay cool for hours, and the put together a great Downton Abbey collection. My collegues are still talking about the crazy tea diffusers. Then I learned more about etiquette and the wine country than I'd ever thought I'd be interested In. Good luck with your biz! I'll see if some of the other guests will leave feedback, but you know people :-( Refreshing to be able to leave good feedback.",,,,
274167,90022,"2020-09-27 02:38:40","Short Fuse Brewing Company",http://www.shortfusebrewing.com,info@shortfusebrewing.com,"(847) 260-5044","5000 N. River Rd","Schiller Park",IL,60176,"5000 N. River Rd,Schiller Park,IL 60176","Restaurants, Bridal Shops, Wineries",,,A+,41.96975,-87.8619,,,"Come visit our 7500 sq ft Taproom with a full-service kitchen. We feature at least 22 beers on tap, and all are made right on site.","Tue - Thu: 11:00 am - 10:00 pm Fri - Sat: 11:00 am - 11:00 pm Sun: 11:00 am - 8:00 pm",,,"cash, discover, master card, visa",,,"http://www.shortfusebrewing.com https://www.shortfusebrewing.com",,,,,,,,,
284649,93617,"2020-09-27 02:38:58","Mike's Affordable Shuttle Bus",http://mikesaffordableshuttle.com,mikesaffordableshuttle@aol.com,"(609) 287-3028",,,,,,"Bus Lines, Airport Transportation, Buses-Charter & Rental, Driving Service, Limousine Service, Party & Event Planners, Party Planning, Shuttle Service, Transportation Services, Wedding Supplies & Services, Wineries",5,"40 Reviews",,,,https://i2.ypcdn.com/blob/c1d61d87931729dda20346c2be70039d2af45542_100x100_crop.jpg?e66d351,,"We provide an affordable,prompt,safe and reliable means of group transportation for your wedding,bachelor/ette, rehersals,concerts,sporting events,proms,wine tours or just a night on the town! We can help you coordinate all your transportation needs with our comfortable shuttle/party busses! When affordability and reliability count call mikes!","Mon - Sun: 9:00 am - 9:00 pm",,,,,,http://mikesaffordableshuttle.com,,"Ciara M.",01/09/2019,five,"Such a pleasant experience using Mike's Affordable Shuttle Bus. We recently used them to take us to and from a Hatchet House. The driver was extremely friendly and accommodating. We also booked them for our wedding this coming July and I am so happy that we did! I would highly recommend using Mike's Affordable Shuttle Bus.","Tina L.",10/01/2018,five,"Hi I booked MikeВ’s Affordable Shuttle in September 2018 for my friendВ’s bachelorette party. Mike was a pleasure to work with and provided me with helpful suggestions in planning the party. Our driver, John (bless him haha), in one word was AWESOME!! He helped us with all our coolers and food, was EXTREMELY patient, and just fun!! We all had the best time at the wineries and even more fun on the bus..... I would highly recommend MikeВ’s Affordable Shuttle Bus for all your transportation needs!!! You will NOT be disappointed....."
289323,95290,"2020-09-27 02:39:04","All American Transportation - Taxi, Limo & Shuttle",,acablimo6910@gmail.com,"(269) 697-0000",,,,,,"Taxis, Airport Transportation, Buses-Charter & Rental, Casinos, Delivery Service, Limousine Service, Shuttle Service, Sightseeing Tours, Tours-Operators & Promoters, Wineries",,,,,,https://i2.ypcdn.com/blob/b00ec5168b33e9a5caa5a72570e2a881d0206573_100x100_crop.jpg?f9d23e1,"We Beat Any Price!","We service everyone and everything. Plus package and part deliveries. Transportation to airports, trains, and buses. Limo service for prom night, wedding party and bachelor/bachelorette party, plus all your formal or special needs. All American provides transportation from coast to coast, we are the only one you need to call. Text Your Next Ride at 313-450-5900 or call 269-697-0000 for all your transportation needs today","Mon - Sun: Open 24 Hours","Text Your Next Ride Here: (313) 450-5900",,"discover, mastercard, amex, visa, debit, all major credit cards",,,,,,,,,,,,
293557,96791,"2020-09-27 02:39:15","American International Transportation Service Inc.",http://www.aitstransportation.com,aits@montereybay.com,"(831) 667-5903","2434 Del Monte Ave",Monterey,CA,93940,"2434 Del Monte Ave,Monterey,CA 93940","Airport Transportation, Bus Lines, Buses-Charter & Rental, Driving Service, Limousine Service, Public Transportation, Tourist Information & Attractions, Transit Lines, Transportation Services, Wedding Supplies & Services, Wineries",,,,36.60482,-121.85983,https://i2.ypcdn.com/blob/91e38e24f22c94c505c5aeb5ac5c39dfdecd02f3_100x100_crop.jpg?e66d351,"We ARE Transportation Service","Luxury Transportation Services in Monterey, California Airport Transportation Rely on the Masters of Californian Transit For more than 30 years, American International Transportation Service, Inc. has provided unsurpassed transportation options for the Greater Bay Area. We have options for every situation or circumstance. From weddings to wine tours, we will give you California with greater convenience and style. Precise Airport Transfers Travel in California can be busy and hectic. Let us ease the process for you with our reliable shuttle services. Our drivers will always be there at least 15 minutes early to ensure your schedule remains on time. Group Travel of Any Size We have everything from small Bentleys to large tour buses. Regardless of the size of your group, weВ’ll get everyone to their destination. Make Your Wedding Perfect Wedding days are glorious but often busy. Let us ease the difficulty of travel and transportation with our luxury selection of chauffeured transit services. Wine Tours Like No Other Our five- to seven-hour trips will provide you a wine-tasting experience like youВ’ve never had. Taste from the scenic Carmel Valley Vintners or Salinas Valley River Road Vintners with us. Transportation for Every Need Our chartered services will ensure that whatever your travel plans are for northern California, we can accommodate. Shopping, dining and sightseeing are all within our purview. WeВ’ll even provide transit to and from your favorite golf range, all at your convenience.","Hours Appointment Only Hours Mon - Sun Open 24 Mon - Sun: 8:00 am - 5:00 pm",,,"amex, visa, mastercard",,"AITS, Inc.","http://www.aitstransportation.com http://www.aitstransportation.net",,,,,,,,,
296397,97801,"2020-09-27 02:39:22","Amazing Blue Cab, Transportation & Limo Shuttle",,,"(269) 697-0000",,"La Porte",IN,46350,"La Porte,IN 46350","Taxis, Airport Transportation, Buses-Charter & Rental, Casinos, Delivery Service, Limousine Service, Shuttle Service, Sightseeing Tours, Tours-Operators & Promoters, Transportation Providers, Transportation Services, Wineries",5,"1 Review",,,,https://i3.ypcdn.com/blob/b00ec5168b33e9a5caa5a72570e2a881d0206573_100x100_crop.jpg?f9d23e1,"We Beat Any Price!","Our limo service was established back in 1990 with a dream to become the best transportation option state-wide. We set out to achieve this by offering our clientele the most luxurious, reliable and safe rides around town. We are happy to provide you with complimentary drinks whether youВ’re travelling to the airport, or just 5 blocks up the road. Rest assured that weВ’ll get you there in style, glitz and comfort. We also believe in providing the safest rides around. Our drivers not only went through an intense defense driving course, but they have all passed background and drug tests. ACAB N Limo N shuttle company always provides the lowest price while offering quality service. Our goal is prompt service to get you where you want to go as quickly as possible . We service the entire Northwest Indiana area , all of Michigan , coast to coast , as well as some area of Illinois . Reservation are accepted, as well as corporate accounts. We provide flat rates to all of the airports such as Chicago O'hare Airport and South Bend Regional Airport . Whether you need a ride to a hotel, casino, home, or even a non-emergency trip to the hospital.","Mon - Sun: Open 24 Hours","Text Your Next Ride Here: (313) 450-5900",,"all major credit cards, invoicing available",,,,"Wheelchair Accessible: Yes Parking: Lot","Doug J.",07/16/2015,five,"Very friendly people and honest",,,,
298236,98452,"2020-09-27 02:39:25","Barrels of Fun",http://barrelsoffunnashville.com,barrelsoffun@yahoo.com,"(310) 749-6359",,,,,,"Tourist Information & Attractions, Buses-Charter & Rental, Places Of Interest, Sightseeing Tours, Tours-Operators & Promoters, Wineries",,,,,,https://i2.ypcdn.com/blob/b89e8b8e05df19a845c9a647e3b620a1a4d19881_100x100_crop.jpg?e66d351,,"Barrels of Fun, LLC provides Wine Tours, Whiskey Tours services in the area TN 37203","M-Su 24hr (We offer 24/7 services.)","Phone: (615) 554-1187 MobilePhone: (615) 227-7357",,"amex, discover, master card, visa",,"Barrels of Fun, LLC",http://barrelsoffunnashville.com,,,,,,,,,
303589,100381,"2020-09-27 02:39:46","Johnny's Pineapple Express Taxi",http://www.johnnyspineappleexpresstaxi.us,jpi48@yahoo.com,"(541) 326-9969","1590 Gravenstein Way",Medford,OR,97501,"1590 Gravenstein Way,Medford,OR 97501","Bus Lines, Airport Transportation, Bus Tours-Promoters, Liquor Stores, Public Transportation, Taxis, Tourist Information & Attractions, Tours-Operators & Promoters, Transit Lines, Transportation Services, Wine, Wineries",,,A+,42.30842,-122.89542,,"Oregon Scenic Tours Including WIneries, Vineyard Tours and Coastal Tours","Locally owned and operated Johnny provides the highest quality experience for your special travel, tours and transportation needs. Johnny's passion is for their local winery tours, they also have taxi services, or airport transporation. Call now to book your special event for work, family and friends. Some of our services include: Winery Tours Tourist Winery Attractions Local Winery Tours Oregon Scenic Tours Coastal Tours Christmas Light Tours Business Events Touring Local Wineries Airport Transportation Out of State Transportation Taxi Service Casino Transportation Pick-up & Delivery Service Clean, Professional, Prompt and Reasonable!! Call Now",,,,"debit, discover, visa, amex, cash, master card",,,http://www.johnnyspineappleexpresstaxi.us,,,,,,,,,
304809,100830,"2020-09-27 02:39:46","Silver Fox Limousine Wine Tour and Transportation",http://www.silverfox-limo.com,reservations@silverfox-limo.com,"(951) 699-4000","27475 Ynez Rd # 197",Temecula,CA,92591,"27475 Ynez Rd # 197,Temecula,CA 92591","Airport Transportation, Bus Lines, Limousine Service, Tours-Operators & Promoters, Wineries",,,,33.50494,-117.14999,,,,"Mon - Sun: 12:00 am - 11:59 pm",,,"visa, amex, discover, mastercard",,,http://www.silverfox-limo.com,,,,,,,,,
314908,104496,"2020-09-27 02:40:19","Northwest Wine Tours",http://northwestwinetours.com,terry@northwestwinetours.com,"(971) 226-7212",,,,,,"Sightseeing Tours, Bus Tours-Promoters, Buses-Charter & Rental, Wineries",,,,,,,,,"Mon - Sat: 8:00 am - 5:00 pm",,,,,,http://northwestwinetours.com,,,,,,,,,
316465,105076,"2020-09-27 02:40:21","Eleven Roses Ranch",http://www.elevenrosesranch.com,,"(707) 998-4471","5456 New Long Valley Rd","Clearlake Oaks",CA,95423,"5456 New Long Valley Rd,Clearlake Oaks,CA 95423","Tourist Information & Attractions, Buses-Charter & Rental, Places Of Interest, Sightseeing Tours, Tours-Operators & Promoters, Travel Agencies, Wineries",,,,39.11098,-122.69287,,,,,,,"master card, visa",,,http://www.elevenrosesranch.com,,,,,,,,,
652452,228564,"2020-09-27 02:52:29","Dial a Bottle Beer and Liquor Home Delivery Branson",,,"(866) 797-2424","3234 W 76 Country Blvd",Branson,MO,65616,"3234 W 76 Country Blvd,Branson,MO 65616","Delivery Service, Beer & Ale, Courier & Delivery Service, Food Delivery Service, Liquor Stores, Wine, Wineries",,,,36.63787,-93.28018,,"""Drink.....DON'T drive! Call Dial a Bottle""","Dial a Bottle Beer and Liquor Home Delivery throughout Branson MO. We will pickup and deliver from your local liquor store and deliver to your residence. Must be 21 to order. ID required.","Mon - Sun: Open 24 Hours",,,"cash only",,,,,,,,,,,,
738384,253803,"2020-09-27 02:55:23","Southern Oregon Valet",,southernoregonvalet@gmail.com,"(541) 840-8038","2255 Ashland St Unit 4",Ashland,OR,97520,"2255 Ashland St Unit 4,Ashland,OR 97520","Party & Event Planners, Parking Attendant Service, Valet Service, Wedding Reception Locations & Services, Wineries",,,,42.18574,-122.67295,,,,"Mon - Sun: Open 24 Hours",,,"debit, check, cash",,,,,,,,,,,,
747897,257123,"2020-09-27 02:55:42","Kathleen Masterton Law Office",http://www.mastertonlaw.com,,"(410) 339-7111","512 Main St",Towson,MD,21204,"512 Main St,Towson,MD 21204","Attorneys, Construction Engineers, Construction Estimates, Custom Photo Finishing Labs, Drive-In Theaters, Driveshafts, Driveway Contractors, Interior Designers & Decorators, Lawn & Garden Equipment & Supplies, Parking Attendant Service, Parking Lots & Garages, Wall Cleaning, Window Cleaning Equipment & Supplies, Windows-Repair, Replacement & Installation, Wineries",,,,39.41987,-76.59521,,,,,,,,,,http://www.mastertonlaw.com,,,,,,,,,
1107767,349236,"2020-09-27 03:04:32","Divine Wine Compliance",http://divinecompliance.com,info@divinecompliance.com,"(707) 963-9733","410 Lafata St Ste 200","Saint Helena",CA,94574,"410 Lafata St Ste 200,Saint Helena,CA 94574","Notaries Public, Business Coaches & Consultants, Food & Beverage Consultants, Liquor Stores, Wine, Wine Brokers, Wineries",,,A+,38.50038,-122.45776,,"Full Service Alcohol Beverage Compliance","ALCOHOL BEVERAGE COMPLIANCE CONSULTANTS, NOTARY SERVICES, WINERY STARTUPS, BUSINESS STARTUPS, BOOKKEEPING SERVICES, BUSINESS REVIEW AND AUDITS","Mon - Fri: 8:00 am - 5:30 pm","After hours contact: (707) 290-0519 Fax: (707) 963-9833",,"visa, discover, mastercard, all major credit cards, paypal, carte blanche, jcb, diners club, company card, amex, check, debit",,,http://divinecompliance.com,,,,,,,,,
1140859,358972,"2020-09-27 03:05:35","Northern Shuttle Service Inc.",,northernshuttleservice@gmail.com,"(503) 550-4861","16004 SW Tualatin Sherwood Rd Ste 117",Sherwood,OR,97140,"16004 SW Tualatin Sherwood Rd Ste 117,Sherwood,OR 97140","Airport Transportation, Limousine Service, Taxis, Wedding Reception Locations & Services, Wineries",,,,45.36858,-122.84142,,,,,"24/7 Live dispach: (503) 550-4861",,"company card, debit, discover, master card, visa",,,,,,,,,,,,
1152553,364679,"2020-09-27 03:06:20","Pal's Car Service",http://www.palscarservice.com,,"(315) 536-7079",,"Penn Yan",NY,14527,"Penn Yan,NY 14527","Tours-Operators & Promoters, Bed & Breakfast & Inns, Taxis, Transportation Providers, Wineries",,,,,,https://i4.ypcdn.com/blob/9ab596dbf5d444a52a36456dc10d7091b51c6555_100x100_crop.jpg?912a958,"We drive, You Experience","We offer private wine and day tours of the Finger Lakes Wine Country serving more than 100 wineries and breweries around Keuka, Seneca and Cayuga Lakes. We also offer transportaion to and from regional air and rail terminals to your choice of lodging accommodations.","Mon - Fri: 8:00 am - 8:00 pm Sat: 9:00 am - 6:00 pm Sun: 9:00 am - 3:00 pm","Text Available on this Number: (585) 337-6084",,"discover, mastercard, amex, paypal, visa, all major credit cards, check, debit",,,http://www.palscarservice.com,,,,,,,,,
1170702,373601,"2020-09-27 03:07:14","Vinnie Vineyard",http://funkmasterv.com,sweetfamilyfunk@yahoo.com,"(865) 384-7589","912 Wears Valley Rd","Pigeon Forge",TN,37863,"912 Wears Valley Rd,Pigeon Forge,TN 37863","Wineries, Taxis",,,,35.79362,-83.59904,,,,"Mon - Sun: Open 24 Hours","Phone: (865) 366-2008",,"mastercard, visa, check, amex, discover, debit, all major credit cards",,,http://funkmasterv.com,,,,,,,,,
1180727,378494,"2020-09-27 03:07:49","J Cole Enterprises Transportation Service",https://www.jcoleenterprises.com,vjcole1@live.com,"(231) 360-1339","7843 Hillside Dr","Traverse City",MI,49685,"7843 Hillside Dr,Traverse City,MI 49685","Taxis, Assisted Living & Elder Care Services, Transportation Providers, Transportation Services, Wineries",5,"4 Reviews",,44.70965,-85.7339,,,"Wheelchair users must be able to transfer to a car seat with assistance.",,"Phone: (231) 935-4009",,"cash, check, insurance",,,https://www.jcoleenterprises.com,,"Calvin ck H.",11/12/2019,five,"Very professional and friendly. I would recommend J Cole Enterprises to anyone needing transportation service. A+",jon.schumacher.7370,10/31/2012,five,"A great bargain at 28 dollars an hour. My elderly father in law received great service."
1181276,378764,"2020-09-27 03:07:49","A local taxi South West City Coach taxi",http://www.temeculataxi.com,gbyler8294@aol.com,"(951) 699-5555","28741 via las flores",murrieta,CA,92563,"28741 via las flores,murrieta,CA 92563","Airport Transportation, Shuttle Service, Taxis, Wine Bars, Wineries",,,,33.55746,-117.15982,,,,"Mon - Sun: Open 24 Hours","9514617111: (951) 699-5555",,"master card, amex, discover, debit, cash, visa",,,www.temeculataxi.com,,,,,,,,,
1185799,380984,"2020-09-27 03:08:07","Roc City Sedan Service",,woodhamshartley@gmail.com,"(585) 851-1322",,Rochester,NY,14623,"Rochester,NY 14623","Transportation Providers, Airport Transportation, Sightseeing Tours, Taxis, Wineries",,,,,,,,"Roc City SZedan Service has been a family owned and operated business since 2010. We are the most professional service with the largest selection of Cadillac Sedans, and Mercedes Benz SUV's. We specialize in Wine Tours, Champagne provided. Transportation to and from the airport or where ever else you may need to travel to. We have all the touches to make your experience a memorable one.",,,,"discover, mastercard, all major credit cards, amex, visa",,,,,,,,,,,,
1375161,436863,"2020-09-27 03:12:44","Lake Liquors.",,,"(641) 357-4430","910 N 8th St W","Clear Lake",IA,50428,"910 N 8th St W,Clear Lake,IA 50428","Liquor Stores, Tobacco, Wineries",,,,43.14277,-93.39631,,,,"Mon - Thu: 9:00 am - 8:00 pm Fri - Sat: 9:00 am - 9:00 pm Sun: 11:00 am - 5:00 pm",,,,,,,"Bike Parking: Yes",,,,,,,,
1375286,436905,"2020-09-27 03:12:44","Capitol Liquor",,,"(401) 941-2430","811 Park Ave",Cranston,RI,02910,"811 Park Ave,Cranston,RI 02910","Wholesale Liquor, Cigar, Cigarette & Tobacco Dealers, Liquor Stores, Wineries",,,A+,41.77871,-71.43435,,,,"Mon - Sun: 8:00 am - 10:00 pm",,,"discover, amex",,,,"Parking: Lot, Free Bike Parking: Yes",,,,,,,,