business_x_category.id,business.id,business.ts,business.business_name,business.home_page,business.email_address,business.phone,business.street,business.city,business.state,business.zip_code,business.full_address,business.category,business.rating,business.number_of_reviews,business.bbb_rating_or_license,business.latitude,business.longitude,business.cover_image,business.slogan,business.general_info,business.regular_hours,business.extra_phones,business.services_products,business.payment,business.price_range,business.aka,business.other_links,business.other_information,business.review_1_name,business.review_1_date,business.review_1_rating,business.review_1_text,business.review_2_name,business.review_2_date,business.review_2_rating,business.review_2_text
10688,3953,"2020-09-27 02:30:47","Hi-Class Limousine",http://hi-classlimo.com,HiClassLimo@gmail.com,"(407) 255-4355",,"Lake Mary",FL,32746,"Lake Mary,FL 32746","Airport Transportation, Advertising Specialties, Advertising-Broadcast & Film, Advertising-Promotional Products, Airline Support Services, Airline Ticket Agencies, Airlines, Airports, Bridal Registries, Bridal Shops, Churches & Places of Worship, Commercial Photographers, Consultants Referral Service, Coupon Advertising, Cruises, Entertainment Agencies & Bureaus, Event Ticket Sales, Facilities & Space Planning Consultants, Family & Business Entertainers, Fashion Designers, Funeral Directors, Limousine Service, Marketing Consultants, Marketing Programs & Services, Modeling Agencies, Pageant Managers & Producers, Port Authorities, Radio Program Producers, Sales Promotion Service, Sports Promoters & Managers, Talent Agencies, Tourist Information & Attractions, Tours-Operators & Promoters, Trade Shows, Expositions & Fairs, Trademark Agents & Consultants, Trams, Transit Advertising, Transit Lines, Transportation Consultants, Transportation Providers, Transportation Services, Travel Agencies, Travel Services-Commercial, Wedding Chapels & Ceremonies, Wedding Music & Entertainment, Wedding Photography & Videography, Wedding Planning & Consultants, Wedding Reception Locations & Services",,,,,,https://i3.ypcdn.com/blob/6faf211744e6defbd18d1ee47f77dc69f11aed0e_100x100_crop.jpg?11da137,,"We are a Luxury Limousine transportation company that provides our customers with safe and luxurios service to there destination .","Mon - Sun: Open 24 Hours","Phone: (407) 569-0990",,"visa, master card, discover, paypal, diners club, carte blanche, company card, jcb",,,"Limousine Transportation Orlando",,,,,,,,,
11403,4340,"2020-09-27 02:30:50","Flair Tours",http://www.flairtours.net,flairusa@yahoo.com,"(615) 361-3737","672 Lake Terrace Dr",Nashville,TN,37217,"672 Lake Terrace Dr,Nashville,TN 37217","Tours-Operators & Promoters, Bus Tours-Promoters, Buses-Charter & Rental, Convention Services & Facilities, Modeling Agencies, Sightseeing Tours, Tourist Information & Attractions",5,"1 Review",,36.0827,-86.61469,https://i3.ypcdn.com/blob/2ad60f623f0d2c4709e149b0c8e84b35e19b5d17_100x100_crop.jpg?11da137,,"Please contact us for more information!",,"TollFree: (866) 729-9411",,,,,"http://www.flairtours.net http://flairmodels.net http://flairtoursnashville.com",,freedombelle,01/26/2009,five,"Great Agency. Really fun bus trips specially the sports trips. Titans, Predators & Braves. Call and reserve your spot.",,,,
13369,5365,"2020-09-27 02:30:57","Flair Talent",http://www.flairmodels.net,,"(615) 988-1887",,Nashville,TN,37217,"Nashville,TN 37217","Talent Agencies, Buses-Charter & Rental, Convention Services & Facilities, Employment Agencies, Lodging, Modeling Agencies, Tours-Operators & Promoters",,,,,,,,,,,,,,,http://www.flairmodels.net,,,,,,,,,
15786,6600,"2020-09-27 02:31:05","Jackson Events & Entertainment, LLC",,happyhouratindigo@jacksoneventsent.com,"(678) 827-2190",,Atlanta,GA,30309,"Atlanta,GA 30309","Party & Event Planners, Entertainment Agencies & Bureaus, Marketing Consultants, Night Clubs, Party Planning, Sales Promotion Service, Talent Agencies, Tours-Operators & Promoters, Wedding Planning & Consultants",,,,,,https://i4.ypcdn.com/blob/bd39ffb7a24556974c802e01765c24f76b2a4ba9_100x100_crop.jpg?11da137,"В“We Are Your One Stop ShopВ”","ABOUT US J.E.E. is your complete business resource for entertainment, providing a high level of professional service, expert knowledge, and multiple business and personal opportunities. Our celebrity booking agents have years of experience in securing and booking the perfect celebrity for your next Event. Our Staff is highly skilled in negotiating and offer unbiased opinions providing suggestions on finding the perfect celebrity for your marketing strategy. Our Staff has over 25 years combined experience with thousands of Celebrities, Music Artist, Models, Comedians, T.V. Personalities and Athletics in our Database, we are certain that we can assist you with any of your talent hiring needs. J.E.E. provide professional guidance in the planning and execution of your event. We are Customer & Client focused, solution oriented and serve as your key contact from your initial call to the event conclusion. We will maximize your budget to ensure you allocate your financial resources appropriately for your Event.","Mon - Fri: 9:00 am - 9:00 pm Sat: 10:00 am - 9:00 pm Sun: 12:00 pm - 8:00 pm","Phone: (404) 549-4702 AfterHoursPhone: (702) 215-9666",,"no credit cards",,J.E.E.,,,,,,,,,,
17919,7753,"2020-09-27 02:31:06","High Town Entertainment inc",,ladealexander@hightownentertainment.com,"(323) 487-0722","11711 Kiowa Ave","Los Angeles",CA,90049,"11711 Kiowa Ave,Los Angeles,CA 90049","Modeling Agencies, Advertising-Promotional Products, Laser Entertainment, Party & Event Planners, Product Design, Development & Marketing, Tours-Operators & Promoters",,,,34.05094,-118.46317,,,,,,,"check, visa, discover, mastercard, all major credit cards, amex, diners club, company card",,,,,,,,,,,,
18044,7786,"2020-09-27 02:31:06","Louis Capet XXVI Music Publishing + Laser Shows",http://www.laserlightshow.org,mf@laserlightshow.org,"(215) 888-8080","2038 Grant Ave",Philadelphia,PA,19115,"2038 Grant Ave,Philadelphia,PA 19115","Theatrical & Stage Lighting Equipment-Services, Artists Agents, Audio-Visual Creative Services, Audio-Visual Equipment-Wholesale & Manufacturers, Audio-Visual Production Services, Casino Equipment & Supplies, Children's Party Planning & Entertainment, Concert Bureaus, Convention Services & Facilities, Convention Services & Supplies, Disc Jockeys, Entertainment Agencies & Bureaus, Fireworks, Fireworks-Public Displays, Fireworks-Wholesale & Manufacturers, Holiday Lights & Decoration Wholesalers & Manufacturers, Holiday Lights & Decorations, Inflatable Party Rentals, Laser Entertainment, Lasers, Lighting Consultants & Designers, Lighting Fixtures, Lighting Systems & Equipment, Meeting & Event Planning Services, Modeling Agencies, Motion Picture Film Distributors & Exchanges, Motion Picture Film Services, Motion Picture Producers & Studios, Music Producers, Music Publishers & Distribution, Musicians, Party & Convention Decorating, Party & Event Planners, Party Favors, Supplies & Services, Party Planning, Party Supplies-Wholesale & Manufacturers, Photo Finishing, Photo Retouching & Restoration, Photographic Equipment & Supplies, Product Design, Development & Marketing, Production Companies-Film, TV, Radio, Etc, Publishers, Publishers Representatives, Publishing Consultants, Radio Program Producers, Radio Stations & Broadcast Companies, Record Labels, Recording Studio Equipment, Rental Supplies-Wholesale & Manufacturers, Searchlights & Floodlights, Talent Agencies, Television Station Equipment, Television Stations & Broadcast Companies, Theatrical & Stage Lighting Equipment, Theatrical Agencies, Theatrical Equipment & Supplies, Theatrical Managers & Producers, Tours-Operators & Promoters, Video Equipment-Installation, Service & Repair, Video Production Services, Video Production Services-Commercial, Wedding Music & Entertainment",5,"1 Review",,40.08278,-75.03293,https://i3.ypcdn.com/blob/6c69b51d157e8ae5a36099ed701d39798f6b4022_100x100_crop.jpg?11da137,,"P.A.W.N. Laser light shows, Laser light show, laser shows, laser billboards, Laser Advertising, RGB laser projectors, laser rentals entertainment, Laser company for hire, Laser Light Show Company, RGB full color lasers, event advertising, pyrotechnics, search lights, searchlights, air inflatable video screens, outdoor Drive-in Movie Theaters, event marketing, outdoor advertisements, branding , development, outdoor, advertising, corporate, event, production, conference lighting, concert lighting, lighting design. LD. We service: New York State Laser, fire works, pyro, pyrotechnics, rgb lasers, FDA registered lasers projection systems, FDA approved Laser systems, FDA Registrar, projection screens, Drive in Movie Theaters, event marketing, special effects, touring lasers, FAA outdoor laser shows, NY State Laser, NYC, AK, AL, AR, AZ, CA, CO, CT, DC, DE, FL, GA, HI, IA, ID, IL, IN, KS, KY, LA, MA, MD, ME, MI, MN, MO, MS, MT, NC, ND, NE, NH, NJ, NM, NV, NY, OH, OK, OR, PA, RI, SC, SD, TN, TX, UT, VA, VT, WA, WI, WV, WY, Alabama, Alaska, Arizona, Arkansas, California, Colorado, Connecticut, Delaware, Florida, Georgia, Hawaii, Idaho, Illinois, Indiana, Iowa, Kansas, Kentucky, Louisiana, Maine, Maryland, Massachusetts, Michigan, Minnesota, Mississippi, Missouri, Montana, Nebraska, Nevada, New Hampshire, New Jersey, New Mexico, New York, North Carolina, North Dakota, Ohio, Oklahoma, Oregon, Pennsylvania, Rhode Island, South Carolina, South Dakota, Tennessee, Texas, Utah, Vermont, Virginia, Washington, West Virginia, Wisconsin, Wyoming","Mon - Sun: Open 24 Hours",,,"visa, mastercard, amex, discover",,,"Primary Website Music Publishing",,"Matthew F.","Edited: 03/18/2017",five,"www.LaserLightShow.ORG - Louis Capet XXVI Limited Liability Co. is one of the longest running Laser Light Show companies in the USA. Additionally, we have an award winning portfolio of music which can be found: online, on FM & Satellite radio, TV, jukeboxes, iTunes, Amazon, Google Play, Spotify, iHeart Radio, and many more. Visit our website at: www.LaserLightShow.ORG We have appeared on the TV shows: MTV Amp, MTV News, WWE World Wrestling Entertainment (Pay Per View), Who's Wedding is it Anyway? (Style Network), Hack (David Morse), Girls Gone Wild (Phila), Josh Wink ""516 Acid"" music video, Chanel 6 ABC & Channel 3 CBS News 2013 & 2014, and also regular appearances on The Science of Philadelphia, and The Science Lab of Grand Hank. Some of our past clients include: Ultra Music Festival (3 times), Detroit Electronic Music Festival (3 Times), Snoop Dogg with Linkin Park, Jay Z, and Ghostface Killah (7 times) on the 2004 Project Revolution US Tour, Co-Executive Technical Stage Producer for 100th Anniversary Boy Scouts of America. Also, 100th Anniversary Borough of Stone Harbor NJ, 175th Anniversary of Pennington School NJ, Red Bull Product Launch at Rock n' Air, Reebok And1 shoe Product Launch, Six Flags Great Adventure 2012, 2013, 2014, & 2016. Goya Foods 2014 Super Bowl Illumination and many more. ----------------------------------------------------------------- FOLLOW Louis Capet XXVI LASERS + RECORDINGS: - http://www.LaserLightShow.ORG ------------------------------------------------------------------ SoundCloud - http://SoundCloud.com/Kings-Recordings Spotify - http://bit.ly/2ji3P1M FaceBook - http://www.FaceBook.com/KingCapetxxvi Twitter - http://www.Twitter.com/LaserLightShow Google+ - https://plus.google.com/+LaserLightShowORG Instagram - http://www.instagram.com/king_recordings YouTube - https://youtube.com/LaserLightShowORG E-Mail - MF@LaserLightShow.ORG Telephone - (215) 888-8080",,,,
37206,16616,"2020-09-27 02:31:34","White Noise Investigations",,,"(214) 449-3005",D/Fw,Plano,TX,75023,"D/Fw,Plano,TX 75023","Inspection Service, Psychics & Mediums, Tours-Operators & Promoters",5,"1 Review",,,,,,,,,,,,,,,michelle123,02/12/2013,five,"White Noise has a great team and does a wonderful job at what they do!",,,,
39507,17848,"2020-09-27 02:31:38","Bloody Marys Tours",,bloodymary@bloodymarystours.com,"(504) 915-7774","941 Bourbon St","New Orleans",LA,70116,"941 Bourbon St,New Orleans,LA 70116","Sightseeing Tours, Party & Event Planners, Party Planning, Psychics & Mediums, Tourist Information & Attractions, Tours-Operators & Promoters, Wedding Planning & Consultants",5,"4 Reviews",,29.96091,-90.05923,,"Come explore New Orleans With Us.","Our mission is to offer our savvy travelers unrivaled diversity through behind the scenes outings on hand-picked, spirit-filled New Orleans Tours. We show you the insider s New Orleans while our storytelling and narration enthralls you. WE offer way more than what you could expect from just any New Orleans tour, we take you One Step Beyond as a New Orleans Voodoo Queen should! Bloody Mary s New Orleans tours specialize in the most unique presentations and serious portrayals of the spirit and magic pulsing throughout New Orleans. We have decades of study to share and years of first hand experiences to execute your outings with a natural finesse so that you can deeply enjoy your adventures. We strive to imbed long lasting memories for you to take home.","Mon - Sun: 11:00 am - 10:00 pm","Phone: (504) 523-7684",,"amex, all major credit cards, debit, discover, master card, visa",,"Bloody Mary's Tours",,"Parking: Street","Jennifer H.",02/06/2017,five,"My husband and I took a empty nester trip! Awesome tour! Thank you to Gina our tour guide. To read my blog about this tour click on the following link http://wp.me/p1F7tq-1L","Nikole L.",02/05/2017,five,"I was in New Orleans for a business trip and me and my associates decided to take a tour. We went on the Ghost Town tour with our fantastic hostess Gina. Gina was very knowledgeable and taught us so many things we had never known about New Orleans. It was a very pleasurable experience that I would definitely do again."
41289,18843,"2020-09-27 02:31:40","Sedona Psychic Wisdom",http://www.sedonapsychicwisdom.com,,"(928) 203-1194","PO Box 3294",Sedona,AZ,86340,"PO Box 3294,Sedona,AZ 86340","Tours-Operators & Promoters, Alternative Medicine & Health Practitioners, Psychics & Mediums",,,,34.858,-111.7867,,,"Kavitaa offers Reiki treatments, intuitive readings and counseling, and energy balancing and healing. Also long-distance Reiki healing and Sedona Vortex tours. Kavitaas sessions are fun, gentle, and loving, yet can go very deep. Her work is grounded in the reality of what is, in the space of the heart.","Mon - Sun: 9:00 am - 5:00 pm",,,,,,www.SedonaPsychicWisdom.com,"Wheelchair Accessible: Yes",,,,,,,,
93762,40385,"2020-09-27 02:33:35","Raw Miami Crew - South Florida bboys",http://www.rawmiamicrew.com,rawmiamicrew@yahoo.com,"(786) 306-4463",,,,,,"Tours-Operators & Promoters, Dance Companies, Entertainment Agencies & Bureaus, Family & Business Entertainers, Video Production Services",,,,,,,,"Raw Miami is a professional and multi-talented group of performers From south Florida. Their performances are jam packed with action, ranging from acrobatics, break dancing, hand balancing, martial arts, and circus arts. Specializing in high energy high impact production, Raw Miami is also known for their show design in television, theatrical stage and video. Production and design credits include MTV,Channel 41,Fox news,Deco drive,Descontrol,Carnival Cruise Lines,Universal studios,Miami Heat, the Florida Marlins,Urban Dance spectacular tour u.s.a,Good morning America, and В”Spanish showsВ” such as Nitido Telemundo,Aqui Todos Ganan telefutura,Latin Billboards awards. The performers have worked with famous artists such as Madonna,Pharell Williams,Daddy Yankee,Angie Martinez,Sean Kingston,Method Man,ll cool j, and Paris Hilton. Raw Miami's goal is to deliver jaw dropping performances with crazy stunts and inspiring performances. For Booking for any special events such as corporate events,Bday parties,bar /bat-mitzvahs,private functions,photoshoots,interviews,commercial work,music videos,15В’s,80В’s theme party and MoreВ…. video links below STREET SHOW LINKhttp://www.youtube.com/watch?v=zrac79EQlRA DEMO REEL LINK http://www.youtube.com/watch?v=9LXMnpUjFCw C.E.O - Robert R. BellContact Phone: 786-306-4463",,"for booking: (786) 306-4463",,"cash only",,,"official website under construction",,,,,,,,,
171816,58096,"2020-09-27 02:35:24","Gold Prospecting Adventures",http://www.goldpanning.com,info@goldprospecting.com,"(209) 984-4653","18170 Main St",Jamestown,CA,95327,"18170 Main St,Jamestown,CA 95327","Gold, Silver & Platinum Buyers & Dealers, Tourist Information & Attractions, Tours-Operators & Promoters",,,,37.95251,-120.42355,https://i1.ypcdn.com/blob/ea1ff37e3428c87c2c3b8d4de0b137a9bb751b81_100x100_crop.jpg?cbd0284,,"Gold Prospecting Adventures, LLC has built a solid reputation throughout California's Gold Country as the best of the best. We are the leading professionals in gold prospecting and gold rush history. That's because we've spent the last 30 + years perfecting our techniques, improving our knowledge, and tailoring our programs to meet the needs of the thousands of guests who visit our amp each year. Our guides receive Gold Prospecting special training to insure that every individual enjoys a remarkably genuine and comprehensive gold rush experience. From the novice to the professional, using a mason jar to fan a crevice, to electronic prospecting. We will open doors you never knew existed No other gold prospecting company can stake that claim!","Mon - Sun: 9:30 am - 4:00 pm","Fax: (209) 984-0711 TollFree: (800) 596-0009",,"all major credit cards",,,"http://www.goldpanning.com http://www.goldprospecting.com",,,,,,,,,
255780,84083,"2020-09-27 02:38:02","Photo Booth Snapshots.com",http://www.photoboothsnapshots.com/contact.html,,"(252) 384-3494",,"Kill Devil Hills",NC,27948,"Kill Devil Hills,NC 27948","Photography & Videography, Bridal Registries, Bridal Supplies-Wholesale & Manufacturers, Display Fixtures & Materials, Identification Card Service, Identification Equipment & Supplies, Novelties-Wholesale & Manufacturers, Party Planning, Party Supplies-Wholesale & Manufacturers, Photographic Equipment & Supplies, Rental Supplies-Wholesale & Manufacturers, Tourist Information & Attractions, Tours-Operators & Promoters, Video Production Services, Wedding Music & Entertainment, Wedding Photography & Videography, Wedding Planning & Consultants, Wedding Reception Locations & Services",5,"1 Review",,,,,"Photo booths are ALL about what happen behind the curtain!.","OUR Company provides a full service photo booth. We will deliver. Setup. And takes down OUR booth. We arrive early and stay until OUR contract time or even later if YOU prefer! OUR booth along with ALL OUR prints are completely customizable. We DO NOT have TWO clients with the same designs! OUR booths NOT only print pictures in 2X6 photo strips. But also a 4X6 in print. Guests CAN choose to print their pictures in color. Black and white. And sepia. OUR booths have green screen technology. SO we CAN independently control the background of the pictures. OUR booth also has the ability to take videos. Pictures and videos CAN BE immediately uploaded on FACEBOOK or twitter or YOU CAN send it OUT via email right from the booth!.","Mon - Sun: 9:00 am - 12:00 am",,,,,,"http://www.photoboothsnapshots.com/contact.html http://www.photoboothsnapshots.com",,obxer,01/04/2013,five,"The service is top notch. Our attendant was a happy people person which made him great to work with. We had so much fun with the props! I keep my photo strip on my desk, it makes me smile .^) I would recommend them to anyone who wants to make their party that much more memorable.",,,,
258878,85071,"2020-09-27 02:38:13","Wethersfield Travel Inc",http://www.wethersfieldtravel.com/,,"(860) 257-3775","219 Main St",Wethersfield,CT,06109,"219 Main St,Wethersfield,CT 06109","Bridal Registries, Airline Ticket Agencies, Cruises, Tourist Information & Attractions, Tours-Operators & Promoters, Travel Agencies, Wedding Supplies & Services",,,A+,41.7123,-72.65289,,,,"Mon - Fri: 9:00 am - 5:30 pm Sat: 10:00 am - 1:00 pm Sun Closed",,,"debit, check, all major credit cards",,"Wethersfield Travel","http://www.wethersfieldtravel.com https://www.facebook.com/WethersfieldTravel",,,,,,,,,
279786,91887,"2020-09-27 02:38:44","Price 4 Limo & Party Bus",http://www.price4limo.com/cheap-limo-service-marietta-georgia.html,,"(404) 551-5441","208 Lawrence St NE",Marietta,GA,30060,"208 Lawrence St NE,Marietta,GA 30060","Limousine Service, Airport Transportation, Buses-Charter & Rental, Shuttle Service, Tours-Operators & Promoters",,,,33.95316,-84.54667,https://i2.ypcdn.com/blob/2bc35b7829ca7ec14d9c7fee9eb8c3fa7d4ed52f_100x100_crop.jpg?e66d351,"Price for Limo books limos and party buses Marietta and surrounding areas",,"Mon - Sun: 8:00 am - 12:00 am",,,"visa, discover, mastercard, all major credit cards, amex",,,"http://www.price4limo.com/cheap-limo-service-marietta-georgia.html Hummer Limo Rentals Price 4 Limo Atlanta & Atlanta Party Bus Rental Columbus GA Party Buses",,,,,,,,,
279799,91890,"2020-09-27 02:38:44","Queen City Tours and Travel",http://www.queencitytours.com,,"(704) 566-0104",,Charlotte,NC,28205,"Charlotte,NC 28205","Tours-Operators & Promoters, Bus Tours-Promoters, Buses-Charter & Rental, Sightseeing Tours, Travel Agencies",5,"1 Review",,,,,"Travel and Tourism Since 1993","Offering Prompt, Professional, and Courteous Tour, Transportation, Travel, Event Planning, and Destination Management services since 1993. Check out our NEW National and International Travel Deals @ www.queencitytours.com","Mon - Sat: 8:00 am - 8:00 pm Sun Closed",,,"check, debit, discover, master card, paypal, travelers checks, visa",,,"Travel and Tourism Since 1993",,jaydeeuu,07/31/2008,five,"I have taken their tours several times when family comes to town. I have also ridden the light rail, the trolley, and did the horse and buggy tour. There is no comparison to the Daily City Tour in that you get to see and learn way more about not just Charlotte history but North Carolina and world history.",,,,
279823,91896,"2020-09-27 02:38:44","Beau Wine Tours & Limousine Service",http://www.beauwinetours.com/napa-valley-wine-tours,tom@beauwinetours.com,"(707) 257-0887","1754 2nd St Ste B",Napa,CA,94559,"1754 2nd St Ste B,Napa,CA 94559","Limousine Service, Airport Transportation, Buses-Charter & Rental, Sightseeing Tours, Tours-Operators & Promoters",,,A+,38.29669,-122.29246,,,"Beau Wine Tours offers custom Napa Valley wine tours and luxury transportation throughout the Bay Area. Whether you are visiting Napa Valley's wine country or San Francisco, our experienced Napa wine tour staff will help you plan the ultimate insider getaway. From wine novice to experienced connoisseur, we can custom design a Napa Valley wine tour to meet your needs. Our dedicated staff has developed extensive relationships with both the small family ""boutique"" Napa wineries, as well as the larger well-known wine estates. allowing Beau Wine Tours access and privileges for our clients which are not generally afforded to the public. Let our professional Napa wine tour guides show you the best-kept secrets and hidden gems of the Napa Valley!","Mon - Sun: 6:00 am - 5:59 am","Fax: (707) 938-8774 TollFree: (800) 387-2328",,"diners club, amex, discover, master card, visa",,"Beau Wine Tours & Limo Service",http://www.beauwinetours.com/napa-valley-wine-tours,,,,,,,,,
279941,91943,"2020-09-27 02:38:44","Black Diamond Tours",,info@blackdiamondtours.com,"(773) 445-9464","10822 S Hale Ave",Chicago,IL,60643,"10822 S Hale Ave,Chicago,IL 60643","Bus Lines, Buses-Charter & Rental, Tours-Operators & Promoters, Travel Agencies",,,,41.69677,-87.6694,,,,,"Phone: (773) 445-8982",,,,"Black Diamond Tours Inc Black Diamond Tours Inc Upper Echelon Limousine",,,,,,,,,,