business_x_category.id,business.id,business.ts,business.business_name,business.home_page,business.email_address,business.phone,business.street,business.city,business.state,business.zip_code,business.full_address,business.category,business.rating,business.number_of_reviews,business.bbb_rating_or_license,business.latitude,business.longitude,business.cover_image,business.slogan,business.general_info,business.regular_hours,business.extra_phones,business.services_products,business.payment,business.price_range,business.aka,business.other_links,business.other_information,business.review_1_name,business.review_1_date,business.review_1_rating,business.review_1_text,business.review_2_name,business.review_2_date,business.review_2_rating,business.review_2_text
8872,3115,"2020-09-27 02:30:47","The Post Box",http://www.thepostbox.net,info@weddingpostbox.net,"(831) 757-7678","820 Park Row",Salinas,CA,93901,"820 Park Row,Salinas,CA 93901","Packaging Service, Banners, Flags & Pennants, Boxes-Corrugated & Fiber, Communications Services, Containers, Courier & Delivery Service, Delivery Service, Desktop Publishing Service, Fax Service, Fingerprinting, Housewares, Mail & Shipping Services, Mailbox Rental, Money Order Service, Notaries Public, Packaging Materials, Packing & Crating Service, Passport Photo & Visa Information & Services, Plastics, Polymers & Rubber Labs, Printing Services, Publishers, Rubber Products, Rubber Products-Manufacturers, Rubber Products-Molded, Secretarial Services, Shipping Room Supplies, Shipping Services",5,"1 Review",,36.66478,-121.65906,,"One Stop Service","One Stop Service","Mon - Fri: 8:30 am - 5:30 pm Sat: 9:00 am - 1:00 pm",,,"all major credit cards, discover",,,http://www.thepostbox.net,,"Chris K.",08/29/2017,five,"I have used their services multiple times for shipping, packaging and faxing. They were great each time. I can highly recommend them.",,,,
148727,53023,"2020-09-27 02:34:50","Dean's Drive-Thru Pawn Shop",http://www.deanspawn.com,fishone@deanspawn.com,"(405) 239-2774","2617 S Robinson Ave","Oklahoma City",OK,73109,"2617 S Robinson Ave,Oklahoma City,OK 73109","Gold, Silver & Platinum Buyers & Dealers, Guns & Gunsmiths, Jewelers, Mail & Shipping Services, Native American Goods, Pawnbrokers, Post Offices, Shipping Services, Sporting Goods, Tools",,,A+,35.43857,-97.51653,https://i2.ypcdn.com/blob/a7a602e0b3b930a44ec57278f50d00a79ca76f64_100x100_crop.jpg?cbd0284,,"Pawn, Gold, Silver, Indian, Turquoise, Jewelry, Diamonds, Tools, Firearms, Pistols, Shotguns, Rifles, Stereo, Radio, Chain, Pendant, Earrings, Videos, TV, Cheap, Value, Inexpensive, Used, Good, Cellular, Magazines, Clips, Bracelet, Necklace, Ring, Sporting, Goods, Guns, Knives, Guitars, Musical, Equipment, Old, New, Shop, Air, Customer, Satisfaction, Oldes, Pawnshop, Oklahoma, City, Pawnbroker, Deans, Pawnshop, Largest, Shop, Specialized in Indian Goods and Dance Regelia!","Mon - Fri: 9:00 am - 6:00 pm Sat: 9:00 am - 5:00 pm",,,"debit, paypal, cash, all major credit cards, visa, discover, mastercard",,"Dean's Drive-Thru Pawnshop","Dean's Pawn Shop","Parking: Lot, Private Wheelchair Accessible: Yes By Appointment Only: No Pets Allowed: No",,,,,,,,
149491,53190,"2020-09-27 02:34:50","Oxford Shipping, Post & Trade",,opandt@gmail.com,"(610) 932-7000","21 N 3rd St",Oxford,PA,19363,"21 N 3rd St,Oxford,PA 19363","Shipping Services, Cigar, Cigarette & Tobacco Dealers, Container Freight Service, Copying & Duplicating Service, Fax Service, Gold, Silver & Platinum Buyers & Dealers, Mail & Shipping Services, Mailbox Rental, Packaging Materials, Packaging Service",,,,39.78582,-75.97826,,,,"Mon - Fri: 8:00 am - 7:00 pm Sat: 9:00 am - 2:00 pm",,,"debit, discover, visa",,,,"Parking: Street, Lot Wheelchair Accessible: Yes",,,,,,,,
162958,56177,"2020-09-27 02:35:11","United States Stamp & Coin Co",http://www.usstampco.com,info@usstampco.com,"(415) 421-7398","5901 Christie Ave",Emeryville,CA,94608,"5901 Christie Ave,Emeryville,CA 94608","Coin Dealers & Supplies, Collectibles, Estate Appraisal & Sales, Gold Stamping, Gold, Silver & Platinum Buyers & Dealers, Hobby & Model Shops, Jewelry Appraisers, Jewelry Buyers, Mail & Shipping Services, Metal Stamping, Rubber & Plastic Stamps, Rubber & Plastic Stamps-Manufacturers Equipment & Supplies, Sports Cards & Memorabilia, Stamp Dealers, Stamps-Rubber, Metal & Plastic, Steel & Brass Stamps",5,"6 Reviews",,37.84018,-122.29552,https://i1.ypcdn.com/blob/842f844fc4432fe67a87f4b1ae90803dc898a925_100x100_crop.jpg?cbd0284,"Established 1928 in San Francisco, is one of the oldest and most trusted stamp, coin and collectible companies in America.","United States Stamp Company Established 1928 in San Francisco, United States Stamp Company is one of the most respected names in the collectible field. For decades we have been a trusted source for buying, selling and appraisals of rare stamps and other collectibles. See Company History for more info. At United States Stamp Company you will receive one-on-one personalized service. Customer service has been the cornerstone of the company since its inception. We offer complimentary evaluations and consultations by appointment to determine the value of your property for immediate direct purchase or consignment. We offer confidential written expert philatelic, numismatic and collectible appraisals for individuals, banks, attorneys, estates, trusts and government institutions. Appraisals can be stated at fair market value or for insurance purposes. Appraisals can be performed in the comfort of your home or at our Emeryville, CA offices. Fees for appraisals are available on request. We are certified USPAP (Uniform Standards of Professional Appraisal Practice) appraisers. We offer several options for the liquidation of any property we evaluate or appraise, including direct purchase, consignment or auction. We offer various services to collectors including personal consultations to help you build a great collection. We are also available to assist you with your В“want listВ” or to help you locate that special item. Take advantage of our many years in the industry and expertise to find the material you may be seeking. Transactions are always confidential.","Mon - Fri: 11:00 am - 6:00 pm",,,"check, paypal",,,http://www.usstampco.com,"Wheelchair Accessible: Yes Bike Parking: Yes","John H.",10/04/2019,five,"Our experience with US Stamp and Coin was first rate. They were easy and professional to deal with and got us excellent results. If you are looking to liquidate collectables these are the people you want to be with.","Michael R.",04/10/2019,five,"Ron was excellent to work with. All of my calls were answered or returned almost immediately. He helped me sort and liquidate a significant stamp, coin, sports memorabilia, DVD and miscellaneous collectible items collection. He also provided an appraisal for several items. I would not have been able to process this collection without his expertise. I would highly recommend US Stamp Company to anyone looking for assistance with anything collectible. If he can't help you directly, he will most surely know someone he can refer you to."
170720,57857,"2020-09-27 02:35:15","MailBox Solutions Plus",http://mbspnewtown.com,,"(701) 627-2245","315 Main St","New Town",ND,58763,"315 Main St,New Town,ND 58763","Mail & Shipping Services, Air Cargo & Package Express Service, Container Freight Service, Direct Mail Advertising, Distributing Service-Circular, Sample, Etc, Document Imaging, Employment Services-Non Profit, Express & Transfer Service, Fax Service, Freight Forwarding, Gold Leaf, Graphic Designers, Letter Shop Service, Mailbox Rental, Maps-Designers, Publishers & Distributors, Moving Boxes, Notaries Public, Outdoor Advertising, Packaging Service, Packing & Crating Service, Party & Event Planners, Passport Photo & Visa Information & Services, Print Advertising, Printing Services, Proofreading, Scanning & Plotting Equipment, Service & Supplies, Seals-Notary & Corporation, Shipping Services, Shredding-Paper, Sign Lettering, Technical Manual Preparation, Typesetting, Vehicle Wrap Advertising, Warehouses-Merchandise, Yard Signs",3,"2 Reviews",,47.97918,-102.48781,https://i1.ypcdn.com/blob/57f73792f8b1f0cdedd132d990cfd48926d71bf7_100x100_crop.jpg?cbd0284,,,"Mon - Fri: 8:30 am - 5:30 pm Sat: 12:00 am - 4:00 pm","Primary Phone: (701) 627-4876",,"mastercard, all major credit cards, amex, discover, visa",,,http://mbspnewtown.com,"Wheelchair Accessible: Yes","Hotsabeanta2000@yahoo.com G.",10/16/2015,one,"This place sucks! Totally disorganized, the wrong mail goes in your box. Who knows where your mail goes. Dropped a package to be delivered to the USPS out of convenience but didn't make it the USPS for 2 days. DON""T USE!","Beverly H.",07/29/2015,five,"The staff are extremely helpful. Professional yet friendly. They offer a Wide array of services. They offer me an actual physical address where my packages can be delivered and signed for and send me notifications when I get mail or packages. They have a wide array of printing capabilities, from Large Format to business cards to return address labels and they have a Graphic Design Artist that is phenomenol. They can even design, print and mail projects like wedding invitations, postcards and more!"
183108,60555,"2020-09-27 02:35:29","Goin' Postal Carlisle",http://www.goinpostal.com,carlisle@goinpostal.com,"(717) 713-4148","419 E High St",Carlisle,PA,17013,"419 E High St,Carlisle,PA 17013","Used & Rare Books, Computer Service & Repair-Business, Gold, Silver & Platinum Buyers & Dealers, Mail & Shipping Services, Shipping Services",,,,40.20151,-77.17912,,,"Goin' Postal Carlisle has been in business since 2007. We specialize in providing all your shipping needs. From FedEx the US Postal Service to Freight (LTL) we have you covered. We can package your items from a wide assortment of boxes and void fill media also. We also offer computer repair at the lowest prices in town along with iPhone, iPad, iPod and android devices. We offer the most competitive prices on buying/selling our customers gold and silver items along with all types of collectibles. From rare coins to war collectibles we will have your item appraised and offer you top dollar for your antique items your looking to sell. Lastly we purchase text books for sale. Please stop in and we will appraise all your books and make you a competitive offer so you walk out with money in your pocket!","Mon - Fri: 9:00 am - 5:00 pm Sat Closed","MobilePhone: (717) 713-4148",,"debit, check, cash, all major credit cards, travelers checks",,,http://www.goinpostal.com,,,,,,,,,
280114,91993,"2020-09-27 02:38:44","JBS Logistics",http://www.jbstrans.com,agizzi@jbstrans.com,"(630) 924-2000","2043 Corporate Ln",Naperville,IL,60563,"2043 Corporate Ln,Naperville,IL 60563","Bus Lines, Air Cargo & Package Express Service, Cold Storage Warehouses, Container Freight Service, Courier & Delivery Service, Delivery Service, Distributing Service-Circular, Sample, Etc, Industrial Equipment & Supplies, Mail & Shipping Services, Mail-Order Fulfillment Service, Packaging Materials, Public & Commercial Warehouses, Public Transportation, Shipping Room Supplies, Shipping Services, Transit Lines, Transportation Consultants, Transportation Services, Trucking",,,A+,41.81098,-88.18848,,"Where service is the driving force.","Welcome to JBS Warehouse Services! JBS Warehouse Services serves Chicago, IL. Since inception, we have sought to provide our customers in Chicago and the surrounding area with high quality warehousing services. Our services include: * Trucking * Warehouses * Fulfillment Service * Warehousing Since 1983, JBS Logistics has been in the transportation, warehousing, and fulfillment business. Located in Glendale Heights, our tracking division primarily focuses on truckload and volume LTL around the Chicago area. For the last 20 years, our brokerage department has also been successful in providing equipment for shippers all over the U.S. We offer pool distribution, local cartage, domestic international air freight services, trucking, and warehousing. If you need commercial shipment, look no further than JBS Warehouse services. For more information concerning our warehousing and distribution services, contact JBS Warehouse Services today. Call now for more details! Call today for all of your warehouse and trucking needs!","Mon - Sun: Open 24 Hours",,,,,,http://www.jbstrans.com,,,,,,,,,
300858,99415,"2020-09-27 02:39:36","Greyhound Package Express",,,"(207) 942-1700","158 Main St",Bangor,ME,04401,"158 Main St,Bangor,ME 04401","Delivery Service, Bus Lines, Mail & Shipping Services",,,,44.79877,-68.77261,,,,,,,,,,,,,,,,,,,
301437,99614,"2020-09-27 02:39:36","Greyhound Package Xpress",http://www.greyhound.com,Greyhound.support@greyhound.com,"(406) 245-5117","2502 1st Ave N",Billings,MT,59101,"2502 1st Ave N,Billings,MT 59101","Delivery Service, Air Cargo & Package Express Service, Bus Lines, Courier & Delivery Service, Mail & Shipping Services",,,,45.78345,-108.50216,,,,"Mon - Sun: 12:00 am - 11:59 pm","TollFree: (800) 739-5020",,,,"Greyhound Package Express","http://www.greyhound.com http://www.shipgreyhound.com https://www.greyhound.com/san-francisco",,,,,,,,,
311522,103252,"2020-09-27 02:40:11","Atlantis Delivery Services Co",http://www.atlantisdelivery.com,,"(407) 377-5995","6584 University Blvd","Winter Park",FL,32792,"6584 University Blvd,Winter Park,FL 32792","Delivery Service, Bus Lines, Courier & Delivery Service, Local Trucking Service, Mail & Shipping Services, Messenger Service, Movers, Transportation Services, Trucking, Trucking-Motor Freight",,,A+,28.59714,-81.29517,,,,"Mon - Fri: 9:00 am - 6:00 pm",,,,,,"http://www.atlantisdelivery.com https://www.atlantisdelivery.com",,,,,,,,,
318626,105865,"2020-09-27 02:40:22","First Transit Courier Service Inc",,,"(865) 577-9476","418 Taliwa Dr",Knoxville,TN,37920,"418 Taliwa Dr,Knoxville,TN 37920","Courier & Delivery Service, Bus Lines, Delivery Service, Mail & Shipping Services",1,"1 Review",,35.94243,-83.90311,,,,,,,,,"First Transit Courier Svc Inc",,,"James P.",09/15/2016,one,"Based on my experience, I DO NOT recommend these people for business or employment. They allow contracts to pay them but still have trouble paying their employees and bills on a regular basis. And they will say ANYTHING to keep you working for them.",,,,
319938,106355,"2020-09-27 02:40:23","Greyhound Lines",http://greyhound.com,ifsr@greyhound.com,"(806) 687-4502","801 Broadway",Lubbock,TX,79401,"801 Broadway,Lubbock,TX 79401","Delivery Service, Bus Lines, Bus Lines Ticket Agencies, Courier & Delivery Service, Mail & Shipping Services, Packaging Service",,,,33.58451,-101.84317,https://i2.ypcdn.com/blob/1f788d967fb2269a05f55ff8c9924b100f2f24b6_100x100_crop.jpg?f9d23e1,,,"6:00 a.m. - 9:00 p.m., Central time zone, Monday through Friday 7:00 a.m. - 9:00 p.m., Central time zone, Saturday and Sunday",,,"discover, amex, master card, visa",,"Greyhound Line Inc Greyhound Package Express","http://greyhound.com http://www.shipgreyhound.com",,,,,,,,,
321562,106916,"2020-09-27 02:40:24","TNT Packaging Inc",http://www.tnt.com/express/en_gb/site/home.html,,"(305) 769-0616","2390 NW 149th St","Opa Locka",FL,33054,"2390 NW 149th St,Opa Locka,FL 33054","Boxes-Corrugated & Fiber, Boxes-Corrugated & Fiber-Wholesale & Manufacturers, Mail & Shipping Services, Packaging Materials, Paper Manufacturers",,,,25.90978,-80.24059,,,,"Mon - Fri: 6:00 am - 3:00 pm","Phone: (305) 640-8990",,"all major credit cards, discover",,"Tnt USA Inc",http://www.tnt.com/express/en_gb/site/home.html,,,,,,,,,
321623,106931,"2020-09-27 02:40:24","International Paper Co",https://www.internationalpaper.com,webfeedback@ipaper.com,"(860) 928-7901","175 Park Rd",Putnam,CT,06260,"175 Park Rd,Putnam,CT 06260","Boxes-Corrugated & Fiber, Boxes-Corrugated & Fiber-Wholesale & Manufacturers, Mail & Shipping Services, Packaging Service, Paper Manufacturers, Stationery Stores",,,,41.88802,-71.89284,,,"International Paper Company, which spans more than 40 countries and employs approximately 83,000 people worldwide, has the capabilities to export products to more than 120 nations. International Paper Company is a worldwide leader in the paper, packaging and wood products industry. It does significant business in paper and paper distribution, packaging and forest products, which include building materials. With nearly 8.5 million acres of land managed in the United States, the company is one of the world's largest private landowners. It distributes printing, packaging, graphic arts, maintenance and industrial products principally through more than 270 distribution branches located primarily in the United States. In addition, International Paper Company owns more than half of Carter Holt Harvey, a New Zealand paper and forest products company with operations in New Zealand and Australia. International Paper Company has its headquarters in Memphis, Tenn., with a location in Putnam, Conn.",,"Primary Phone: (901) 419-7000 Phone: (860) 928-2739 Fax: (860) 928-2739 TollFree: (800) 826-0592",,"discover, all major credit cards, amex, visa, mastercard",,"International Paper Company","https://www.internationalpaper.com http://internationalpaper.com http://arborgen.com",,,,,,,,,
322560,107212,"2020-09-27 02:40:32","Shorr Packaging Corp",http://www.shorr.com,,"(888) 885-0055","4000 Ferry Rd",Aurora,IL,60502,"4000 Ferry Rd,Aurora,IL 60502","Packaging Service, Boxes-Corrugated & Fiber, Mail & Shipping Services, Package Design & Development, Packaging Machinery, Packaging Materials, Paper Products, Shipping Services",,,,41.80723,-88.23218,,,"Founded more than 80 years ago, Shorr Packaging provides paper and packaging products. Established in 1922 as the Illinois Wholesale Company, the company originally sold supplies to bakeries and grocery stores. By the late 1960s, Shorr became experts at the distribution of industrial packaging, retail packaging and maintenance supplies. Its offers 24-hour emergency repairs, complete rebuilds, custom modifications, operator training, replacement parts, routine maintenance as well as start-ups and installations. Shorr services machinery such as bagging systems, banders, strappers, carton erectors, case sealers as well as case and tray formers, coding systems, shrink wrap equipment, stretch wrappers and void fill systems. Shorr Packaging is located in Aurora, Ill.","Mon - Fri: 8:00 am - 5:00 pm","Phone: (630) 499-3130",,,,"Shorr Packaging Corporation Shorr Packagaing Corporation",http://www.shorr.com,,,,,,,,,
322615,107231,"2020-09-27 02:40:32","Kapstone Container Corporation",http://www.kapstonepaper.com,,"(404) 765-1701","2370 Sullivan Rd",Atlanta,GA,30337,"2370 Sullivan Rd,Atlanta,GA 30337","Boxes-Corrugated & Fiber, Boxes-Corrugated & Fiber-Wholesale & Manufacturers, Mail & Shipping Services, Packaging Materials, Paper Manufacturers",,,,33.62461,-84.46575,,,,"Mon - Fri: 8:00 am - 5:00 pm Sat - Sun Closed","Phone: (404) 763-3309 Phone: (404) 765-0846 Phone: (404) 768-7140 Primary Phone: (404) 768-7140",,,,,http://www.kapstonepaper.com,"Parking: Lot, Free Wheelchair Accessible: Yes",,,,,,,,
322725,107260,"2020-09-27 02:40:32","Suburban Industrial Packaging",http://suburbanind.com,mhansen@suburbanind.com,"(314) 535-5300","1519 Tower Grove Ave","Saint Louis",MO,63110,"1519 Tower Grove Ave,Saint Louis,MO 63110","Packaging Materials, Boxes-Corrugated & Fiber, Janitors Equipment & Supplies, Mail & Shipping Services, Packaging Machinery, Packaging Materials-Wholesale & Manufacturers, Packaging Service, Packing & Crating Service, Paper Products, Plastic Bags",4,"1 Review",,38.62291,-90.25606,,,,"Mon - Fri: 8:00 am - 3:00 pm","Phone: (314) 535-5395 Fax Number: (314) 535-5395",,"master card, amex, visa",,,http://suburbanind.com,,candyshipper1,05/19/2009,four,"I have worked with this company for the last 7 years, they are wonderful. They take alot of pride in their work performance and truly care about their customers. I will continue to work with them on a daily basis, and believe that if you give them the chance they will impress you also.",,,,
322827,107287,"2020-09-27 02:40:32","Sink Paper & Packaging",,austin@sinkpaper.com,"(515) 331-9000","12044 Ridgemont Dr",Urbandale,IA,50323,"12044 Ridgemont Dr,Urbandale,IA 50323","Packaging Materials, Janitors Equipment & Supplies, Mail & Shipping Services, Packaging Materials-Wholesale & Manufacturers, Paper Products, Paper-Wholesale & Manufacturers, Shipping Room Supplies",,,,41.63271,-93.78053,https://i4.ypcdn.com/blob/ac25b2a35a3864fe2bc8ad6fe28d5e86a08074d4_100x100_crop.jpg?63f80dd,,,"Mon - Fri: 8:00 am - 5:00 pm","Phone: (515) 331-9006 Fax: (515) 331-9000",,"discover, check, amex, visa, cash, financing available, master card",,,,,,,,,,,,
323309,107403,"2020-09-27 02:40:32","Ozark Packaging",,,"(417) 725-3573","1005 N Gerald St",Nixa,MO,65714,"1005 N Gerald St,Nixa,MO 65714","Boxes-Corrugated & Fiber, Boxes-Corrugated & Fiber-Wholesale & Manufacturers, Mail & Shipping Services, Packaging Materials, Packaging Materials-Wholesale & Manufacturers, Paper Manufacturers",,,,37.05934,-93.30533,,,,"Mon - Fri: 7:30 am - 5:00 pm Sat - Sun Closed","Phone: (417) 725-1494 Fax: (417) 725-1494",,"cash only",,"Ozark Packaging Inc",,,,,,,,,,
323354,107417,"2020-09-27 02:40:32","Kamar Pack 'N Ship",http://kamarinc.com,info@kamarinc.com,"(970) 879-2591","1821 Kamar Plz Unit 3","Steamboat Springs",CO,80487,"1821 Kamar Plz Unit 3,Steamboat Springs,CO 80487","Packaging Materials-Wholesale & Manufacturers, Mail & Shipping Services, Packaging Service, Paper Manufacturers",,,,40.50123,-106.85368,,,,,"Fax: (970) 870-0461",,,,,http://kamarinc.com,,,,,,,,,
323433,107439,"2020-09-27 02:40:32","Sacramento Container Corp",http://www.saccontainer.biz,scc@saccontainer.biz,"(916) 614-0580","4841 Urbani Ave",Mcclellan,CA,95652,"4841 Urbani Ave,Mcclellan,CA 95652","Boxes-Corrugated & Fiber, Boxes-Corrugated & Fiber-Wholesale & Manufacturers, Mail & Shipping Services, Paper Manufacturers",,,,38.65728,-121.41626,,,"Located in McClellan, Calif., Sacramento Container Corporation provides packaging design and inventory control services. It offers corrugated containers, as well as provides packaging solutions for warehousing and distribution issues. The company offers storage systems for sheets and finished goods. Sacramento Container Corporation also supplies rotary die-cutters and flexo-folder-gluers. Its vehicle fleet includes loading docks and curtain and straight vans. The company additionally features an online section that provides pictures of several packaging systems and materials.",,"Phone: (916) 614-0590 Fax: (916) 614-0590",,,,"Sacramento Container Corporation","http://www.saccontainer.biz https://www.packagingcorp.com",,,,,,,,,
323495,107461,"2020-09-27 02:40:32","Pacific Quality Packaging",https://pacific-qp.com,,"(714) 257-1234","660 Neptune Ave",Brea,CA,92821,"660 Neptune Ave,Brea,CA 92821","Boxes-Corrugated & Fiber, Boxes-Corrugated & Fiber-Wholesale & Manufacturers, Mail & Shipping Services, Packaging Materials, Paper Manufacturers",,,,33.92928,-117.91285,,,,,"Phone: (714) 257-1797 Fax: (714) 257-1797 Fax Number: (714) 257-1797",,,,"Pacific Quality Packaging Corporation",https://pacific-qp.com,,,,,,,,,