business_x_category.id,business.id,business.ts,business.business_name,business.home_page,business.email_address,business.phone,business.street,business.city,business.state,business.zip_code,business.full_address,business.category,business.rating,business.number_of_reviews,business.bbb_rating_or_license,business.latitude,business.longitude,business.cover_image,business.slogan,business.general_info,business.regular_hours,business.extra_phones,business.services_products,business.payment,business.price_range,business.aka,business.other_links,business.other_information,business.review_1_name,business.review_1_date,business.review_1_rating,business.review_1_text,business.review_2_name,business.review_2_date,business.review_2_rating,business.review_2_text
12920,5129,"2020-09-27 02:30:57","Labette Health Urology",https://www.labettehealth.com/clinics/urology-clinic/,,"(620) 820-5545","1902 S Us Highway 59",Parsons,KS,67357,"1902 S Us Highway 59,Parsons,KS 67357","Physicians & Surgeons, Urology, Hospitals, Physicians & Surgeons, Urgent Care",,,,37.338886,-95.26929,,"Dedicated to Providing Exceptional Healthcare","Biography There are a number of symptoms that may lead to a range of urological conditions. Men and women alike stand a good chance of needing a urologist some time in life for manageable and/or treatable urological conditions. Dr. Logan Wineland, Mayo Clinic trained, provides exceptional care and most up to date treatment options.",,"Main Hospital: (620) 421-4881",,,,,"https://www.labettehealth.com/clinics/urology-clinic/ Express Care","Parking: Lot, Free Wheelchair Accessible: Yes",,,,,,,,
33571,14619,"2020-09-27 02:31:29","Flat Iron Psychic",,,"(212) 676-0324","123 Washington Street","New York",NY,10006,"123 Washington Street,New York,NY 10006","Psychics & Mediums, China, Crystal & Glassware, Chinese Restaurants, Physicians & Surgeons, Physicians & Surgeons, Family Medicine & General Practice, Psychologists, Temporary Employment Agencies, Travel Agencies",,,,40.70915,-74.0137,,,,"Mon - Sun: 9:00 am - 11:00 pm",,,,,,,,,,,,,,,
35536,15685,"2020-09-27 02:31:32","Awakening Heart Psychic Readings $",http://www.awakeningheartslc.com,awakeningheart22@aol.com,"(385) 715-0373","1956 S 1100 E","Salt Lake City",UT,84106,"1956 S 1100 E,Salt Lake City,UT 84106","Psychics & Mediums, Astrologers, Physicians & Surgeons, Psychiatry",5,"6 Reviews",,40.72756,-111.8597,,"Daily Psychic and Palm Readings, Astrology Charts, Aura Photos, and Much More.","Our Vision If you are a seeker of something deeper in your life, and are going through some difficult times, then Awakening Heart Psychic Readings may be for you. We are open now for 15 years, and we daily still realize how the idea of finding yourself thru spiritual readings and meditation have helped. This business that we have is just a reflection of what we are still realizing and that is, that you do create your own reality according to the beliefs that you have. We believe that there has always been something deeper in life. You must try to seek the message that you create your own reality by the beliefs that you have. In the late 60's and early 70's, this was a very radical idea. It took many many years to really understand how that worked. Eventually we started to understand it and that was when we decided it was time to finally start my own business and be in control of ones life.","Mon - Thu: 11:30 am - 6:30 pm Fri: 11:30 am - 6:00 pm Sat: 11:00 am - 6:00 pm Sun Closed",,,"amex, visa, debit, master card",,,http://www.awakeningheartslc.com,,donaknakldakdbakfe33,03/01/2012,five,"I grew up with Awakening Heart and encourage supporting local bookstores.",lucyzinke11,03/01/2012,five,"I am a heavy reader and I absolutely love coming to the Awakening Heart. Not only will they order any book that is still in publishing, but they carry many magazines that you cannot find elsewhere in Salt Lake City. The staff is very nice. It is expensive, but I truly don't mind paying more in order to keep this place going (not as if they look like they are having a hard time - the place is always packed). I never have a hard time parking."
37101,16560,"2020-09-27 02:31:34","Quail Hollow Psychotherapy",http://quailhollowtherapy.com,,"(360) 207-3052","401 Discovery View Dr",Sequim,WA,98382,"401 Discovery View Dr,Sequim,WA 98382","Psychics & Mediums, Mental Health Services, Physicians & Surgeons, Psychiatry, Psychologists, Psychotherapists",,,,48.08464,-122.92323,https://i2.ypcdn.com/blob/f7b1e31f09dd5e7c76318e37f8bf237ab47f3b21_100x100_crop.jpg?f9d23e1,"Psychotherapy can change your life.","Are you worried or depressed? Feeling overwhelmed and wondering about your ability to cope? Repeating mistakes in life? Do you want to understand yourself or your relationship to someone else more fully? Psychotherapy is a wonderful opportunity for you to explore whatever may seem troubling to you. Psychotherapy will help you understand your problems and your life, enabling changes. While addressing problems areas of life, psychotherapy also brings personal and spiritual growth and healing. Call us today!",,,,"cash, paypal",,,http://quailhollowtherapy.com,"Specialties: Sadness, Depression, Anxiety, Worry, Panic Disorders",,,,,,,,
38887,17491,"2020-09-27 02:31:38","Divine Guidance & Therapeutic Touch",http://www.divineguidance444.com,divineguidance444@msn.com,"(509) 307-5867","803 Millenium Ave",Moxee,WA,98936,"803 Millenium Ave,Moxee,WA 98936","Psychics & Mediums, Alternative Medicine & Health Practitioners, Clinics, Hypnotherapy, Physical Therapists, Physical Therapy Clinics, Physicians & Surgeons, Rehabilitation Services",,,,46.55004,-120.37242,https://i2.ypcdn.com/blob/733f3cb114b20b2b4125d5febf5dc61dc954cd47_100x100_crop.jpg?f9d23e1,"Psychic Readings, Intuitive Readings, Reiki","Jenette has recieved her Bachelors of Psychology and her Masters of Social Work before adding complementary healing modalities to her ""healing tool box"". Jenette gained her 2 year certification as a Healing Arts Practitioner from The Academy of Healing Arts, and she was certified as an Angel Therapy Practitioner by Doreen Virtue, Ph. D. Jenette uses her clairaudient, clairsentient, and clairvoyant gifts to communicate with the angels and guides in order to provide her clients with the best guidance possible. She is direct, compassionate and down to earth.",,,,"check, paypal",,,"Main Website",,,,,,,,,
46202,21248,"2020-09-27 02:31:59","Pearl Orthopedic Footwear",http://pearlfootwear.com,pearlfoot@verizon.net,"(315) 472-0101","716 E Washington St Ste 103",Syracuse,NY,13210,"716 E Washington St Ste 103,Syracuse,NY 13210","Orthopedic Shoe Dealers, Custom Made Shoes & Boots, Medical Equipment & Supplies, Orthopedic Appliances, Physicians & Surgeons, Orthopedics, Shoe Repair, Shoe Stores",,,,43.04931,-76.14122,https://i2.ypcdn.com/blob/d78261bfa7f36359322fd70823d8967207f83096_100x100_crop.jpg?f9d23e1,,"Pearl Orthopedic Footwear is a locally owned and operated company founded by Richard Perelmut in 1993. Richard is a certified pedorthist, and he brings 35 years of training and experience to Pearl Orthopedic Footwear.","Mon - Fri: 9:00 am - 5:00 pm Sat - Sun Closed","Fax: (315) 472-0190",,"all major credit cards",,,http://pearlfootwear.com,"Parking: Lot, Free Wheelchair Accessible: Yes",,,,,,,,
49006,22365,"2020-09-27 02:32:04","The Foot Comfort Store",http://www.footcomfortstore.com,thefootcomfortstoreinc@yahoo.com,"(760) 598-3668","1830 Hacienda Dr Ste 5",Vista,CA,92081,"1830 Hacienda Dr Ste 5,Vista,CA 92081","Orthopedic Shoe Dealers, Medical Equipment & Supplies, Physicians & Surgeons, Physicians & Surgeons, Orthopedics, Shoe Repair, Shoe Stores",5,"1 Review",,33.18576,-117.28037,,,,"Mon - Fri: 10:00 am - 6:00 pm Sat: 10:00 am - 5:00 pm Sun Closed","Phone: (760) 330-5351 Phone: (760) 598-6089 Fax: (760) 598-6089 Fax Number: (760) 598-6089 TollFree: (866) 618-5542",,"master card, visa, all major credit cards",,,http://www.footcomfortstore.com,"Parking: Lot, Private Wheelchair Accessible: Yes Bike Parking: Yes By Appointment Only: No","Juliette S",02/03/2010,five,"When I bought shoes from Allison at Foot Comfort she gave me a wide variety, wide price rang, a very personal experience, i left in complete comfort and a week later when they were broken in more, her co worker Jesse built up my insoles for no charge to give the the best fit possible. Thank you.",,,,
51147,23186,"2020-09-27 02:32:07","Hosford Shoes",http://www.hosfords.com/contactus.htm,gaittec@icx.net,"(865) 688-9495","3403 N Broadway St",Knoxville,TN,37917,"3403 N Broadway St,Knoxville,TN 37917","Orthopedic Shoe Dealers, Home Health Care Equipment & Supplies, Orthopedic Appliances, Physicians & Surgeons, Podiatrists, Shoe Repair, Shoe Stores",,,,36.00257,-83.9265,,,,"Mon - Thu: 10:00 am - 5:30 pm",,,"visa, amex, check, mastercard",,"Hosford Shoes & Orthopedic Lab Hosford Shoes & Orthopedic Laboratory",http://www.hosfords.com/contactus.htm,"Specialties: Athletic Injuries, Injuries, Arthritis & Rheumatism, Diabetes-Related Problems, Rheumatic Diseases",,,,,,,,
55215,24764,"2020-09-27 02:32:08","Magro's Family Shoe Store",,,"(219) 874-3861","1806 Franklin St","Michigan City",IN,46360,"1806 Franklin St,Michigan City,IN 46360","Orthopedic Shoe Dealers, Orthopedic Appliances, Physicians & Surgeons, Physicians & Surgeons, Orthopedics, Physicians & Surgeons, Pediatrics-Orthopedic Surgery, Shoe Repair, Shoe Stores",,,,41.70626,-86.89581,,,,"Mon - Fri: 9:00 am - 5:30 pm Sat: 9:00 am - 3:00 am Sun Closed","Phone: (219) 879-0208 Fax: (219) 879-0208",,"amex, discover",,"Magro's Orthopedic Service Magro's Orthopedic SVC",,"Price Range : Average",,,,,,,,
57784,25753,"2020-09-27 02:32:12","Lotempio Shoe Repair & Store",http://www.merchantcircle.com/business/LoTempio.Shoe.Repair.And.Store.585-671-8289,shoewizard@gmail.com,"(585) 671-8289","790 Ridge Rd",Webster,NY,14580,"790 Ridge Rd,Webster,NY 14580","Canvas Goods, Cleaning Contractors, Laces, Leather Cleaning, Leather Goods Repair, Orthopedic Shoe Dealers, Physicians & Surgeons, Orthopedics, Shoe Repair, Shoe Shining, Shoe Stores",,,A+,43.20481,-77.47786,https://i1.ypcdn.com/blob/70d3cdeecce3451635f5826987bd5f7cae3dcc7c_100x100_crop.jpg?f9d23e1,,,"Mon Closed Tue - Fri: 9:00 am - 6:00 pm Sat: 9:00 am - 3:00 pm","Phone: (585) 787-2760 TollFree: (888) 430-7467",,"amex, all major credit cards",,,http://www.merchantcircle.com/business/LoTempio.Shoe.Repair.And.Store.585-671-8289,"Parking: Lot, On Site Wheelchair Accessible: Yes Specialties: Zippers, Luggage",,,,,,,,
59229,26329,"2020-09-27 02:32:12","Northgate Comfort Shoes",http://www.hanger.com,dave.kinsley@novacare.com,"(320) 259-5899","510 25th Ave N Ste 3","Saint Cloud",MN,56303,"510 25th Ave N Ste 3,Saint Cloud,MN 56303","Orthopedic Shoe Dealers, Medical Equipment & Supplies, Orthopedic Appliances, Physicians & Surgeons, Physicians & Surgeons, Orthopedics, Physicians & Surgeons, Pediatrics-Orthopedic Surgery, Prosthetic Devices, Shoe Repair, Shoe Stores",,,,45.56322,-94.1872,,,,"Mon - Fri: 8:00 am - 5:00 pm Sat - Sun Closed","Phone: (320) 251-9440 Phone: (320) 251-9392 Phone: (320) 252-9166 Primary Phone: (320) 251-9440 Fax: (320) 251-9392 Fax: (320) 252-9166",,"check, insurance",,"Hanger Orthopedic Grp Hanger Orthopedic Group Inc. Hanger Orthopedic Group",http://www.hanger.com,"Specialties: Diabetes",,,,,,,,
59954,26610,"2020-09-27 02:32:13",Dia-Foot,http://www.dia-foot.com,contacts@dia-foot.com,"(561) 641-1865","10101 Lantana Rd Ste M","Lake Worth",FL,33449,"10101 Lantana Rd Ste M,Lake Worth,FL 33449","Orthopedic Shoe Dealers, Home Health Care Equipment & Supplies, Physicians & Surgeons, Podiatrists, Shoe Repair, Shoe Stores",,,,26.59212,-80.20752,,,,,"Phone: (561) 791-1213",,"master card, visa",,Diafoot,http://www.dia-foot.com,,,,,,,,,
61901,27359,"2020-09-27 02:32:21","Smith's Orthopedic Shoes Inc",http://www.smithsshoes.com,smithsshoes@sbcglobal.net,"(432) 363-4271","5101 Twin Towers Blvd",Odessa,TX,79762,"5101 Twin Towers Blvd,Odessa,TX 79762","Orthopedic Shoe Dealers, Home Health Care Equipment & Supplies, Orthopedic Appliances, Physicians & Surgeons, Physicians & Surgeons, Orthopedics, Shoe Repair, Shoe Stores",,,,31.90091,-102.34023,,"WE PROVIDE PERMIAN BASIN WITH LARGEST SELECTION OF ON-HAND INVENTORY. NEW ARRIVALS DAILY!","WE CARRY THE LARGEST SELECTION OF SIZES AND WIDTHS FOR MEN, WOMEN, AND CHILDREN. PRESCRIPTION, DIABETIC, ARTHRITIC FOOTWEAR, CUSTOM SHOE CASTING, ORTHOPEDIC MODIFICATIONS & REGULAR & STEEL TOE BOOTS ARE OUR SPECIALTY. COME SEE US TODAY!","Mon - Tue: 9:00 am - 5:30 am Wed: 9:00 am - 7:00 am Thu - Fri: 9:00 am - 5:30 am Sat - Sun Closed",,,"master card, visa, all major credit cards",,,http://www.smithsshoes.com,"Parking: Lot Bike Parking: Yes Wheelchair Accessible: Yes",,,,,,,,
63287,27897,"2020-09-27 02:32:21","Shoe Cobbler",http://www.norcoshoecobbler.com,raffishoecobbler@gmail.com,"(951) 227-6744","2646 Hamner Ave",Norco,CA,92860,"2646 Hamner Ave,Norco,CA 92860","Shoe Repair, Leather, Leather Goods Repair, Orthopedic Shoe Dealers, Physicians & Surgeons, Orthopedics, Shoe Shining, Shoe Stores",5,"3 Reviews",,33.92017,-117.55963,https://i2.ypcdn.com/blob/b5bc8827dec2758a4328a012ef950f91c01f6c6b_100x100_crop.jpg?f9d23e1,,"Shoe Cobbler specializing in orthopedic work. We also repair Fireman boots and Law Enforcement boots as well as all types Western boots, dress shoes and handbags. Shoe shine service available as well as same day service. Shoe Cobbler has been serving the community of Norco and surrounding areas for over 40 years. Quality workmanship is our specialty! Stop in today! Mention ""online offer"" for 10% off any service","Mon - Fri: 9:00 am - 5:30 pm Sat: 9:00 am - 3:00 pm Sun Closed",,,"cash, debit, discover, visa, master card",,,"http://www.norcoshoecobbler.com https://norcoshoecobbler.com",,georgeiv,09/28/2012,five,"LOCAL GUY, BIG HEART, AND BEST SERVICE I have worked in the luxury service industry for over 15 years and the Shoe Cobbler provides service that exceeds Nordstrom level. He is genuine, professional, and is a product knowledge expert when it comes to anything leather related, especially shoes. His pricing is very resonable! Give this guy your business, you'll be happy with the experience. See you soon Raffi!",milksi909,12/09/2011,five,"This place is amazing had some really old shoes and didn't money to buy brandnew ones soo I went to see what could be done left looking brandnew i was amazed know i now i dont have to buy shoes often for this cheap of a price everytime i take my car to get washed my shoes are gettin a scrub too!!!!!!"
65397,28730,"2020-09-27 02:32:29","Hammer & Stitch Shoe Repair",https://www.facebook.com/hammerandstitchshoe,hnsshoerepair@gmail.com,"(417) 208-9261","401 W 7th St",Joplin,MO,64801,"401 W 7th St,Joplin,MO 64801","Shoe Repair, Custom Made Shoes & Boots, Leather, Leather Cleaning, Leather Goods, Leather Goods Repair, Physicians & Surgeons, Orthopedics, Shoe Stores",,,,37.08423,-94.51701,https://i1.ypcdn.com/blob/039e3ae6ef9ef12cb6f6a0f5cb208806b5361d30_100x100_crop.jpg?f9d23e1,"Get your fix on Route 66","Local and family owned business on Route 66. H&S specializes in Shoe and boot repair. You can also bring in your handbags, belts, and any other leather items you may need fixed, tailored, or replaced. Come visit us today!","Mon - Thu: 9:00 am - 5:30 pm Fri: 10:00 am - 3:30 pm Sat - Sun Closed",,,"amex, cash, debit, discover, visa, master card",,,website,,,,,,,,,
66060,29002,"2020-09-27 02:32:40","Canul Shoe Repair",,canulshoerepair@hotmail.com,"(707) 537-8545","20 Elaine Dr","Santa Rosa",CA,95409,"20 Elaine Dr,Santa Rosa,CA 95409","Shoe Repair, Physicians & Surgeons, Orthopedics",5,"1 Review",,38.46389,-122.66305,https://i2.ypcdn.com/blob/27af7aa37c60fbaa22d02180f8cbe3151c5da83b_100x100_crop.jpg?f9d23e1,,,"Mon Closed Tue - Fri: 9:00 am - 5:00 pm Sat: 9:30 am - 3:30 pm Sun Closed",,,"check, debit, mastercard, visa",,,,,alejandra2012,10/08/2012,five,"Thanks. Raymondo for the great job you did. for taking the time you're. work is very appreciate in this day's. is hard to find a good cobbler, and fix orthopedic shoes. For your personality .The good customer service I like the connection you make with each customer and for been helpful. thank you thank you...",,,,
66968,29345,"2020-09-27 02:32:40","Johns Orthopedic &Amp",,johnsortho@gmail.com,"(201) 339-8750","929 Broadway",Bayonne,NJ,07002,"929 Broadway,Bayonne,NJ 07002","Shoe Repair, Custom Made Shoes & Boots, Orthopedic Shoe Dealers, Physicians & Surgeons, Orthopedics, Shoe Stores",,,,40.67952,-74.10546,https://i1.ypcdn.com/blob/0fb98841fa4ee73860a7b4733523c5900c100472_100x100_crop.jpg?f9d23e1,,"JohnВ’s Orthopedic has made it their mission to provide, certified orthopedic services, expert repair service, exceptional customer service, and a wide selection of comfort footwear to their customers.","Mon - Tue: 10:00 am - 5:30 pm Wed Closed Thu: 10:00 am - 5:30 pm Fri: 9:30 am - 4:30 pm Sat: 9:30 am - 3:00 pm Sun Closed",,,"all major credit cards, amex, discover, mastercard, visa",,"John's Orthopedic & Shoe Repair John's Orthopedic & Shoe Repair",,,,,,,,,,
70267,30612,"2020-09-27 02:32:42","Cobbler's Bench Foot Health Center",http://www.cobblersbench.org,,"(989) 652-2566","995 S Main St",Frankenmuth,MI,48734,"995 S Main St,Frankenmuth,MI 48734","Orthopedic Appliances, Custom Made Shoes & Boots, Medical Clinics, Orthopedic Shoe Dealers, Physicians & Surgeons, Podiatrists, Shoe Repair, Shoe Stores",,,,43.32184,-83.73997,,"""More Than Just a Shoe Store""","After working seven years for Rohde's Leather Shop and learning all about shoe and leather construction from two master craftsmen, John Ostermiller opened The Cobbler's Bench Shoe and Leather Repair in 1987 in Frankenmuth, MI. In 1989, John went to Ball State to get his certification as an Orthopedic Shoe Technician. He learned about different modifications that could be done to a shoe. These include short limb buildup, rocker soles to help with ambulation, different wedging techniques to help with balance, and orthopedic construction to help with foot structure. In 1999, John became a Board Certified Pedorthist where he learned bio-mechanics, gait analysis, foot assessment, foot anatomy and patient care. The following year, in 2000, The Cobbler's Bench Shoe and Leather Repair became The Cobbler's Bench Foot Health Center. Footwear was added, staff was increased from three to eight employeesmany being family members and friends who share the same mission to help people. With continuing growth, John asked his wife Patti, then a local retail manager, to come on board to manage the new facility. At that time the store became qualified as a DMERC supplier of medical goods which allowed the facility to dispense footwear to diabetics under the Medicare program. In 2004, The Cobbler's Bench was fortunate enough to have DeAnn McCulloch, who had been apprenticing under John for three years, become the facility's second Board Certified Pedorthist. Our mission statement: Together as a team, our goal is to improve the quality of life of an individual by improving their foot health.","Mon - Fri: 9:00 am - 5:30 pm Sat: 9:00 am - 2:00 pm Sun Closed",,,insurance,,,http://www.cobblersbench.org,,,,,,,,,
71898,31250,"2020-09-27 02:32:52","Physicians Footwear",http://www.footandankle-usa.com,,"(301) 696-0600","63 Thomas Johnson Dr",Frederick,MD,21702,"63 Thomas Johnson Dr,Frederick,MD 21702","Orthopedic Shoe Dealers, Physicians & Surgeons, Physicians & Surgeons, Podiatrists, Shoe Repair, Shoe Stores",,,,39.45132,-77.40301,,"Keeping You On Track For Life",,"Mon - Fri: 9:00 am - 6:00 pm","Phone: (301) 696-0908",,"master card, visa",,,"http://www.footandankle-usa.com http://www.physiciansfootwear.com",,,,,,,,,
73692,31964,"2020-09-27 02:32:52","Faklis Dept. Store Shoe Repair & Orthopedic Services",https://faklis.com,,"(727) 938-1525","139 E Tarpon Ave","Tarpon Springs",FL,34689,"139 E Tarpon Ave,Tarpon Springs,FL 34689","Orthopedic Shoe Dealers, Custom Made Shoes & Boots, Home Health Care Equipment & Supplies, Orthopedic Appliances, Physicians & Surgeons, Physicians & Surgeons, Orthopedics, Physicians & Surgeons, Pediatrics-Orthopedic Surgery, Prosthetic Devices, Shoe Repair, Shoe Stores",,,,28.14651,-82.75536,,,,"Mon - Fri: 9:00 am - 5:30 pm Sat: 9:00 am - 3:00 pm Sun Closed","Phone: (727) 937-3602 Phone: (727) 938-1669 Primary Phone: (727) 937-3602 Primary Phone: (727) 934-5685 Phone: (727) 934-5685 Fax: (727) 938-1669 TollFree: (877) 309-3617",,"amex, discover",,"Faklis Department Store & Shoe Faklis Orthopedic Service Faklis' Department Store & Shoe Repair Faklis Orthotics & Pro Faklis Deptartment Store and Shoe Repair Faklis Orthotics & Pedorthics Faklis Department Store And Shoe Repair","https://faklis.com http://www.faklis.com","Specialties: Golf Bags, Sports Injuries, Zippers",,,,,,,,
75464,32670,"2020-09-27 02:32:55","West Lawn Service",,jonwildwildwest34@yahoo.com,"(757) 816-1779","119 Esplanade Pl",Chesapeake,VA,23320,"119 Esplanade Pl,Chesapeake,VA 23320","Landscaping & Lawn Services, Aircraft-Hangars-Rental & Sales, Banquet Halls & Reception Facilities, Bingo Halls, Builders Hardware, Chemical Storage & Handling, City Halls, Coffee Roasting & Handling Equipment, Computer Hardware & Supplies, Concert Halls, Dance Halls, Electrical Wire Harnesses, Fish Hatcheries, Garment Hangers, Gutters & Downspouts Cleaning, Hair Braiding, Hair Removal, Hair Removing Equipment & Supplies, Hair Replacement, Hair Stylists, Hair Supplies & Accessories, Hair Weaving, Halls, Auditoriums & Ballrooms, Hamburgers & Hot Dogs, Hammocks, Hand Painting & Decorating, Hand Tools, Handbags, Handbags-Wholesale & Manufacturers, Handwriting Analysts & Experts, Handyman Services, Hang Gliding & Instruction, Hardware Stores, Hardware-Wholesale & Manufacturers, Hardwood Floors, Hardwoods, Harvesting-Contract, Hat Shops, Hats-Wholesale & Manufacturers, Hawaiian Goods, Hawaiian Restaurants, Hay, Hay Rides, Hazardous Material Control & Removal, Hazardous Waste Engineers, Landscape Contractors, Livestock Hauling, Marine Hardware, Material Handling & Processing Engineers, Material Handling Equipment, Material Handling Equipment-Wholesale & Manufacturers, Oil Field Hauling, Oil Handling Equipment, Physicians & Surgeons, Hand Surgery, Picture Hanging Service, Pipe Hangers, Pool Halls, Poultry Hatcheries, Saddlery & Harness, Sand & Gravel Handling Equipment, Second Hand Dealers, Sexual Harassment Attorneys, Signs-Erectors & Hangers, Trash Hauling, Trucking-Heavy Hauling, Trucking-Light Hauling, Wallpaper Hanging Equipment & Supplies, Wigs & Hair Pieces",,,,36.73466,-76.26674,,,,"Mon - Sun: Open 24 Hours",,,,,,,,,,,,,,,