business_x_category.id,business.id,business.ts,business.business_name,business.home_page,business.email_address,business.phone,business.street,business.city,business.state,business.zip_code,business.full_address,business.category,business.rating,business.number_of_reviews,business.bbb_rating_or_license,business.latitude,business.longitude,business.cover_image,business.slogan,business.general_info,business.regular_hours,business.extra_phones,business.services_products,business.payment,business.price_range,business.aka,business.other_links,business.other_information,business.review_1_name,business.review_1_date,business.review_1_rating,business.review_1_text,business.review_2_name,business.review_2_date,business.review_2_rating,business.review_2_text
43759,20224,"2020-09-27 02:31:48","The Dawn Of A New Age",http://blessedrose.com,leopardgoose@netscape.net,"(732) 664-2734","117 Highway 70",Lakewood,NJ,08701,"117 Highway 70,Lakewood,NJ 08701","Pet Stores, Holistic Practitioners, Metaphysical Products & Services, Personal Development, Psychics & Mediums, Spiritualists, Writers",,,,40.04773,-74.21624,,,,"Wed: 8:00 am - 12:00 am Fri: 8:00 am - 12:00 am Sat - Sun: 8:00 am - 3:00 pm","Phone: (732) 920-1533",,,,,http://blessedrose.com,"Parking: Lot",,,,,,,,
184529,61004,"2020-09-27 02:35:40","Comfy Dog Boots",http://www.comfydogboots.com,lori@comfydogboots.com,"(207) 385-9550",,"Greenville Junction",ME,04442,"Greenville Junction,ME 04442","Pet Services, Custom Made Shoes & Boots, Pet Specialty Services, Pet Stores, Tailors",5,"1 Review",,,,https://i4.ypcdn.com/blob/cf60d0d73df401ad0322307f4f0c92993d5bad84_100x100_crop.jpg?912a958,"The dog boot that is the most comfortable for your pet","I design dog booties and dog coats. I also do custom dog booties for elderly,injured or ill dogs","Mon - Sun: Open 24 Hours",,,"debit, check, paypal, all major credit cards",,,"Dog Boots and Coats",,"Lori M.",02/09/2013,five,,,,,
278266,91395,"2020-09-27 02:38:44","Cbling Intimates",http://cblingboutique.com,cblingintimates@gmail.com,"(772) 999-2360","1355 us highway 1","Vero Beach",FL,32960,"1355 us highway 1,Vero Beach,FL 32960","Bridal Shops, Corsets & Girdles, Lingerie, Lubricants, Pet Stores",,,,27.62587,-80.39034,,,,"Mon Closed Tue - Sat: 11:00 am - 7:30 pm Sun Closed",,,,,,http://cblingboutique.com,"Wheelchair Accessible: Yes",,,,,,,,
328936,108936,"2020-09-27 02:40:40","Griffieon Farms",http://www.griffieonfarms.com,griffieon@msn.com,"(515) 650-9422","6561 NE 46th St",Altoona,IA,50009,"6561 NE 46th St,Altoona,IA 50009","Hay, Farm Equipment, Farming Service, Farms, Feed Dealers, Feed-Wholesale & Manufacturers, Paper Manufacturers, Paper Products, Pet Services, Pet Stores, Sawdust & Shavings, Wood Products",,,,41.67967,-93.52036,,,"Selling fresh farm to table products and other home grown products. The products are sold online and in person. Serving the Altoona, Iowa community and surrounding area.","Mon - Fri: 9:00 am - 5:00 pm Sat - Sun Closed",,,"amex, cash, check, debit, discover, master card, visa",,,http://www.griffieonfarms.com,,,,,,,,,
631962,223400,"2020-09-27 02:51:48","Drive NO More Delivered Goods",http://www.drivenomore.com,drivenomoredelivery@gmail.com,"(877) 464-4994","1007 Red Alder Cir",Houston,TX,77073,"1007 Red Alder Cir,Houston,TX 77073","Courier & Delivery Service, Beauty Supplies & Equipment, Delivery Service, Dry Cleaners & Laundries, Food Delivery Service, Gift Shops, Grocery Stores, Hair Supplies & Accessories, Office Equipment & Supplies, Pet Stores, Pet Supplies & Foods-Wholesale & Manufacturers, Pharmaceutical Products, Restaurant Delivery Service, Take Out Restaurants, Vape Shops & Electronic Cigarettes, Wigs & Hair Pieces",4,"1 Review",,30.01709,-95.4153,https://i3.ypcdn.com/blob/d8c841d506cac46251f87f6257effb3547905028_100x100_crop.jpg?d9a04b5,"You Choose We Deliver!","You Choose We DELIVER!","Mon - Thu: 4:00 pm - 7:00 pm Fri - Sun Closed",,,"visa, discover, mastercard, all major credit cards, debit, paypal",,,http://www.drivenomore.com,,"Dawnisha R.",02/02/2017,four,"Communication is great. Always keeps me informed on my order. Will let others know about their services. I love that they deliver from all types of stores. I needed a cell phone charger and they went out to get it within 45 minutes! Will use again.",,,,
817187,278840,"2020-09-27 02:57:42","Dollar Buster #15",https://dollarbuster15.com,dollarbuster15@yahoo.com,"(708) 652-6076","4832 W Cermak Rd",Cicero,IL,60804,"4832 W Cermak Rd,Cicero,IL 60804","General Merchandise, Baby Accessories, Furnishings & Services, Decorative Ceramic Products, Discount Stores, Furniture Stores, Grocery Stores, Hardware Stores, Housewares, Lamps & Shades, Luggage, Mattresses, Party Favors, Supplies & Services, Pet Stores, School Supplies & Services, Thrift Shops",,,A+,41.85163,-87.74595,https://i2.ypcdn.com/blob/4f5e62de9297e212bf1c4387be195f5618549e26_100x100_crop.jpg?f9d23e1,,"Dollar Buster #15, in Cicero, IL, is the leading dollar store serving Chicago, Berwyn, Summit, Stickney, Oak Park, Oak Lawn and surrounding areas since 2000. We offer furniture, party supplies, groceries, hardware, school supplies, balloons, kitchenware, cleaning and pet supplies, mattresses, carpet, baby supplies, tables, lamps, luggage and much more. For your next shopping spree, visit Dollar Buster #15 in Cicero.","Mon - Sun: 9:00 am - 9:00 pm",,,"discover, cash, visa, mastercard, amex, apple pay, android pay",,,"Primary Website Facebook",,,,,,,,,
838789,285406,"2020-09-27 02:58:22","Humane Society Of Central Oregon Thrift Store",https://api.superpages.com/xml/search?SRC=ypintfeed&subaffiliate=DXC&PGID=e02.7182.8182845904523&SPGID=1581692238854.6b8e8a20&ADID=42568&DEST=http%3A%2F%2Fhsco.mydex.com%2FpC9_nu102eY&C=thrift%20shops&T=Bend&S=OR&PH=(541)%20678-5658&FL=url&TL=off&position=3&PS=30&PI=1&Results=FEED_CLCK&uid=6b8e8a20-6b72-4f96-96bf-20f86ff004e8&REF=&IP=68.183.156.206&UserAgent=Mozilla%2F5.0%20(Windows%20NT%206.1%3B%20Win64%3B%20x64)%20AppleWebKit%2F537.36%20(KHTML%2C%20like%20Gecko)%20Chrome%2F70.0.3538.102%20Safari%2F537.36,marcy@hsco.org,"(541) 678-5658","61220 S Highway 97",Bend,OR,97702,"61220 S Highway 97,Bend,OR 97702","Thrift Shops, Housewares, Pet Stores, Used Furniture",,,,44.02332,-121.31456,,,,"Mon - Sat: 10:00 am - 7:00 pm Sun: 10:00 am - 6:00 pm",,,"debit, check, cash, all major credit cards",,,"http://www.HSCO.org http://www.hsco.org/thrift-stores","Bike Parking: Yes Parking: Lot",,,,,,,,
869021,292533,"2020-09-27 02:58:57","Nature's Market",http://www.naturesmarketkent.com,info@naturesmarketkent.com,"(253) 854-5395","26011 104th Ave SE",Kent,WA,98030,"26011 104th Ave SE,Kent,WA 98030","Nutritionists, Beverages, Food Products, Gourmet Shops, Grocers-Ethnic Foods, Grocery Stores, Health & Wellness Products, Pet Services, Pet Stores, Supermarkets & Super Stores, Vitamins & Food Supplements, Weight Control Services",4,"2 Reviews",A+,47.36863,-122.20277,,"Live, Learn, Be Healthy!","Nature's Market is a natural food and supplement store that has stood on Kent, WA's East Hill for 38 years. We are home to over 6,000 square feet of natural and organic groceries, vitamins, natural remedies, and body care products. Nature's Market features: Organic produce Gluten-free products Vitamins and supplements Fresh juices and smoothies Prepared sandwiches, salads, and soups Dairy Frozen food Beer and wine Specialty pet food Nature's Market offers incomparable customer service. Our experienced staff is always happy to answer questions and help you find what you need. If you need something we don't carry, we are also happy to place special orders! Call Nature's Market now to learn more or come and explore. You'll be glad you did!","Mon - Fri: 9:00 am - 8:00 pm Sat: 9:00 am - 7:00 pm Sun: 10:00 am - 6:00 pm",,,"cash, check, master card, visa",,,"http://www.naturesmarketkent.com http://m.naturesmarketkent.com","Parking: Lot, Private Wi-Fi: No Bike Parking: No Wheelchair Accessible: Yes Price Range : Average","Tammy S.",04/08/2014,four,"I often go to Nature's Market for hard to find items, they have the biggest gluten free selection in the state, and even have lots of other allergen free foods, like egg free soy free mayo. The only reason they do not get a full 5 stars is the high prices. Which is to be expected somewhat in a health food store. they do have coupons you can sign up to receive at least! Great store though, I do recommend it!",mommysaves,01/17/2008,four,"I've started shopping at Nature's Market when I was told I could be allergic to wheat, corn, and soy. Walking around this store, I was able to find many other options that allowed me to still eat well. The prices are reasonable for ""health food"", though they are a bit more expensive than a regular grocery store. The staff are very helpful too."
990610,320705,"2020-09-27 03:01:53","Gartex Masonry Supply Inc",http://gartexmasonry.com,sales@gartexmasonry.com,"(214) 343-0571","10310 Plano Rd",Dallas,TX,75238,"10310 Plano Rd,Dallas,TX 75238","Masonry Equipment & Supplies, Brick-Clay-Common & Face, Building Contractors, Building Materials, Engraving, Fireplace Equipment, Fireplaces, Heating Equipment & Systems, Masonry Contractors, Paving Contractors, Paving Materials, Pet Stores, Signs, Stone Cast, Stone Natural, Stone Products, Swimming Pool Equipment & Supplies",5,"1 Review",A+,32.88951,-96.69976,,,,,,,"visa, discover, mastercard",,,http://gartexmasonry.com,,ohdoorman,03/15/2012,five,"Very helpful, Quick service",,,,
1005613,324266,"2020-09-27 03:02:20","Annandale Monument Company",http://www.annandalemonument.com,Vincent@PU-M.com,"(888) 786-5100","940 Elm St E",Annandale,MN,55302,"940 Elm St E,Annandale,MN 55302","Home Improvements, Cemetery Equipment & Supplies, Funeral Planning, Funeral Supplies & Services, Granite, Home Repair & Maintenance, Monuments, Pet Services, Pet Stores, Signs, Stone Products",5,"1 Review",,45.25539,-94.10484,https://i2.ypcdn.com/blob/ec32dc2224e4fb4815254dd3c19d76f49dff858e_100x100_crop.jpg?f9d23e1,"Whether You're Planning Ahead Or You Wish To Honor The Legacy Of Someone That Has Passed Away We're Here To Help.","Our Company PenUltimate Monument has been a family owned business that was established over 50 years ago by my grandfather, Vincent Kittok. Formally known as Annandale Monument Company. We offer a wide variety of memorial products to remember the legacy of someone that has passed away. Memorials stand as a lasting tribute to mark a legacy and final resting place. In making such a choice, every consideration should be given to the quality and permanence of the materials from which a memorial is created. Products are fabricated in St. Cloud MN by skilled craftsman that take extreme pride in their work. You'll find dozens of useful resources on this website, including invitations to attend one of our free seminars on pre-planning benefits. You'll also find free printed guides on funeral and estate planning and links to additional web resources, and answers to your most frequently asked questions. Our Team Vincent Hylla took over his grandfather's business in 2009 with many years of experience before taking over. Vincent graduated from the University of St Thomas in St. Paul MN with a degree in Entrepreneurship, Catholic Studies, and Philosophy. Vincent has lived in Minnesota all his life and his family have lived in the Annandale area for over 30 years. Vincent enjoys helping families make memorial choices and understands the importance in the grieving and healing process. Planning Ahead With PenUltimate Monument Every single day, we see families struggle to make difficult decisions during the most emotional times. We see the stress, the tears, and the outpouring of emotion that comes from not knowing what Mom, Dad, Brother, or Sister may have wanted. Some of these families never experience the peace that comes with true closure because they question their decisions long after the fact. And some of these families carry this emotional burden for far too long. While there are many reasons to pre-plan, this is the number one reason that pre-planning your cemetery and funeral arrangements is so important. As professionals in the cemetery and memorial industry, we understand and acknowledge that discussing one's mortality is an extremely uncomfortable topic. However, we can help you and your family experience the sense of peace that only comes from knowing that your wishes will be carried out and that your loved ones will not have to make these difficult decisions at the time of death. Designs are varied, ranging from simple, traditional headstones to personalized sculptures. We provide an excellent alternative to more traditional memorials or monuments, custom granite benches provide many unique uses, including using the bench as the family headstone and surrounding the bench with flat grave markers. We recognize that not all of the significant influences on our lives are human. Because of this, we are proud to offer you custom pet grave markers to remember the life of your most beloved pet.","Mon - Fri: 10:00 am - 4:00 pm",,,"amex, discover, visa, mastercard",,"Penultimate Monument",http://www.annandalemonument.com,,"Vincent H.",05/04/2015,five,"In 2009 Vince Hylla and former PenUltimateMonument now Annandale Monument Company installed a beautiful monument honoring life from conception to natural death on the grounds of the University of St. Thomas in St. Paul, Minnesota. Since that time I have seen Vincent's company grow and would like to recommend anyone in the Annandale area to him for their monument needs. Vince has also been a great friend through the years and is now a loving father and husband. I wish him and Annandale Monument Company only the very best in their future endeavors.",,,,
1277924,408950,"2020-09-27 03:10:05","Don's Welding",http://donswelding.net,dooliv50@gmail.com,"(209) 380-0831","3007 S Carpenter Rd",Modesto,CA,95358,"3007 S Carpenter Rd,Modesto,CA 95358","Welders, Building Contractors, Farms, Livestock Breeders, Metal Tanks, Metal Tubing, Pet Services, Pet Stores, Steel Erectors, Steel Processing, Trailers-Equipment & Parts-Wholesale & Manufacturers, Welding Equipment & Supply, Welding Equipment Repair",,,,37.59004,-121.03065,,,"....................Come see us........................................................................................................................","Mon - Fri: 9:00 am - 5:00 pm",,,"discover, mastercard, visa, all major credit cards, amex",,,http://donswelding.net,,,,,,,,,
1426610,453095,"2020-09-27 03:14:21","Road Show The",http://theroadshowinc.com,info@theroadshowinc.com,"(586) 779-7623","28500 Gratiot Ave",Roseville,MI,48066,"28500 Gratiot Ave,Roseville,MI 48066","Clothing Stores, Gift Shops, Pet Stores, T-Shirts, Tobacco",,,,42.50556,-82.93039,,,,"Mon - Sat: 10:30 am - 8:30 pm Sun: 12:00 pm - 4:30 pm",,,"debit, cash, all major credit cards",,,http://theroadshowinc.com,"Parking: Lot, Private Bike Parking: Yes Wheelchair Accessible: Yes Price Range : Average",,,,,,,,
1721656,517294,"2020-09-27 03:21:21","Roach Feed & Seed",https://roachfeed.com,roachfeed@yahoo.com,"(972) 829-4550","409 Main St",Garland,TX,75040,"409 Main St,Garland,TX 75040","Pet Food, Aquariums & Aquarium Supplies, Birds & Bird Supplies, Farm Equipment, Farming Service, Farms, Grain Dealers, Home Improvements, Home Repair & Maintenance, Landscaping Equipment & Supplies, Lawn & Garden Equipment & Supplies, Pet Services, Pet Stores, Shopping Centers & Malls",5,"2 Reviews",,32.91296,-96.63582,https://i1.ypcdn.com/blob/2f7fbf1e132941ae0d731680d225d18a94045be1_100x100_crop.jpg?f832250,"Locally Owned and Operated Since 1933. Extraordinary Customer Service. Exceptional Knowledge Base and Extensive Product Selection.","Roach Feed & Seed has been locally owned and operated since 1933. Our old-fashioned wood floors will take you back to a time of impeccable customer service and friendly people. Still today, this is what you will find when you enter our store. Our staff can help you diagnose and treat lawn and pest problems. We have the chemicals you need to do the job right the first time. We offer classes for those interested in learning to Garden or raise chickens in their backyard. Roach Feed & Seed also, focuses on the best feed from your pets to your livestock. Come in today and see what we have for you!","Mon - Sat: 8:00 am - 6:00 pm Sun: 1:00 pm - 5:00 pm",,,"discover, visa, master card, amex",,,https://roachfeed.com,"Parking: Lot",gewdld,12/24/2009,five,"We're intercity couple from the north but whenever I need anything from termite treatment to in season plants to medicines and special treats for my dogs, my husband shop at Garland Roach Feed & Seed. They have EVERYTHING you need for your home, pets and farm animals. Very knowledgeable staff and prices lower than the the big box chain stores.............gotta go there now to get straw/hay for my dog houses, it getting cold ! Thanks Roach Feed & Seed",bunnyhopper20,07/06/2009,five,"My family found this place several years ago. We get our dog food, guinea pig and parakeet food here as well. We actually purchased a guinea pig from them. The different staff members that have helped us have always been patient with my kids many questions. In the back of the store is a pet area for supplies. We also visited at Christmas time, when they had a huge spread of homemade goodies that they made as a way of saying thanks to their customers! It really is like going back in time walking into that store. PS. My dog really enjoys picking out his favorite treat from dog treat isle......... An entire isle dedicated to dog treats! There is also one for wild and domestic bird feed, so basically, something for everyone finned, feathered or four- legged! The Dempseys, of Dallas"
1731260,519283,"2020-09-27 03:21:54","Pittsboro Feed",http://www.pittsborofeed.com,david@pittsborofeed.com,"(919) 542-2454","1103 East St",Pittsboro,NC,27312,"1103 East St,Pittsboro,NC 27312","Pet Food, Farm Equipment, Farm Equipment Parts & Repair, Feed Dealers, Fuel Oils, Gas Companies, Gas-Liquefied Petroleum-Bottled & Bulk, Pet Services, Pet Stores, Propane & Natural Gas, Utility Companies",,,,35.71996,-79.15751,,"Feed or Seed We Cover your Need.","Pittsboro Feed is family owned and operated. David and Chrsitine have owned the store since 1992, but there agricultural background stretches back much farther. We are a traditional feed store and offer a wide variety of items for your agricultural needs. We offer Chicks, Feed, Chickens, Small Animals, Horse Feed, Pet Food, Seed-Lawn and Garden, Organics. We also carry seasonal offerings such as Spring Plants, Full pumpkins and winter Fresh Cut Christmas trees. Stop by and see us.","Mon - Fri: 8:00 am - 6:00 pm Sat: 8:00 am - 3:00 pm Sun Closed","Fax: (919) 545-9682",,"cash only",,,http://www.pittsborofeed.com,"Parking: Lot",,,,,,,,
1740876,521828,"2020-09-27 03:22:08","Belle Farm",http://www.bellefarm.org,broadforkfarm@yahoo.com,"(828) 584-6680","3851 Kathy Rd",Morganton,NC,28655,"3851 Kathy Rd,Morganton,NC 28655","Utility Companies, Beekeeping & Supplies, Farm Equipment, Farm Supplies, Feed Dealers, Gas Companies, Livestock Feeding, Pet Food, Pet Stores, Pet Supplies & Foods-Wholesale & Manufacturers, Poultry, Poultry Equipment & Supplies, Propane & Natural Gas",,,,35.70026,-81.8112,,".A Good Product and Good Customer Service","From small beginnings in 1983 to a retail store on Kathy Road and a mail order facility on US 70 serving an international community, we have continued our original goal: В“A Good Product and Good Customer Service.В” We credit our success to continually striving to fulfill that goal with knowledgeable and faithful employees","Mon - Fri: 8:00 am - 6:00 pm Sat: 8:00 am - 3:00 pm Sun Closed","Walk-Ins only: (828) 584-6680",,"visa, master card, discover, debit, cash",,,http://www.bellefarm.org,"Specialties: Farm Animals, Propane Tanks, Poultry, Farms, Propane Cylinders, Horses, Livestock",,,,,,,,
1740970,521849,"2020-09-27 03:22:08","Diver's Garden & Pet Supplies",http://diversgarden.wordpress.com,diver986@aol.com,"(513) 783-2761","1810 1st Ave",Middletown,OH,45044,"1810 1st Ave,Middletown,OH 45044","Firewood, Feed Dealers, Fertilizers, Garden Centers, Gas Companies, Landscaping Equipment & Supplies, Lawn & Garden Equipment & Supplies, Mulches, Pet Food, Pet Stores, Pet Supplies & Foods-Wholesale & Manufacturers, Petroleum Oils, Petroleum Products, Propane & Natural Gas, Salt, Utility Companies",,,A+,39.51266,-84.39363,,,,"Mon - Fri: 8:00 am - 5:30 pm Sat: 8:00 am - 1:00 pm",,,"mastercard, all major credit cards, amex, discover, visa",,,"http://diversgarden.wordpress.com http://www.middletownpetsupplies.com","Parking: Lot Specialties: Marine Fish, Salt Water Fish, Horses, Birds",,,,,,,,
1743058,522396,"2020-09-27 03:22:13","Mounds Pet Food Warehouse",http://www.moundspet.com,askthetrainer@moundspet.com,"(608) 758-9998","1725 Lodge Dr",Janesville,WI,53545,"1725 Lodge Dr,Janesville,WI 53545","Pet Specialty Services, Gas Companies, Horse Equipment & Services, Livestock Equipment & Supplies, Pet Services, Pet Stores, Pet Supplies & Foods-Wholesale & Manufacturers, Propane & Natural Gas, Saddlery & Harness, Utility Companies",,,,42.71764,-89.00045,,,,"Mon - Fri: 9:00 am - 8:00 pm Sat: 9:00 am - 6:00 pm Sun: 10:00 am - 5:00 pm",,,"all major credit cards",,,http://www.moundspet.com,,,,,,,,,
1748245,523778,"2020-09-27 03:22:21",Seaworld,http://www.flowerbarnnursery.com,,"(586) 532-0014","29800 Gratiot Ave",Roseville,MI,48066,"29800 Gratiot Ave,Roseville,MI 48066","Tropical Fish, Arboretums, Botanical Gardens, Collectibles, Garden Centers, Gas Companies, Gift Shops, Holiday Lights & Decorations, Pet Food, Pet Services, Pet Stores, Ponds & Pond Supplies, Propane & Natural Gas, Tourist Information & Attractions, Utility Companies",5,"3 Reviews",,42.5154,-82.9239,https://i1.ypcdn.com/blob/154a666ccece1cb037320fde2ff2e879e9dc0a1b_100x100_crop.jpg?f832250,,,"Mon - Sat: 10:00 am - 8:00 pm Sun: 10:00 am - 6:00 pm","Phone: (586) 771-7700",,,,,http://www.flowerbarnnursery.com,"Bike Parking: Yes Price Range : Average","Brian V.",02/17/2012,five,"I just stopped in last week after not being to the store for 10 years. The new owners have really fixed up the place. Everything was super clean and the animals all looked very healthy. The guy helping me was very helpfull and knew his stuff. I will be back.",Kaptain,08/28/2011,five,"New Owners - Dog Adoption, Sept 10, 24 2011 from 12 to 4pm. Dog & Cat food - Must see pricing, meet or beat competitors coupons. Visit the many Worlds - Sea, Garden, Christmas, Gift, Dog, Cat. established 1954, many collectibles."
1748423,523828,"2020-09-27 03:22:21","Mounds Pet Food Warehouse",http://moundspet.com/,,"(608) 221-0210","2110 S Stoughton Rd",Madison,WI,53716,"2110 S Stoughton Rd,Madison,WI 53716","Pet Specialty Services, Dog & Cat Furnishings & Supplies, Gas Companies, Pet Food, Pet Grooming, Pet Services, Pet Stores, Propane & Natural Gas, Utility Companies",,,,43.06736,-89.3106,,,,"Mon - Fri: 9:00 am - 8:00 pm Sat: 9:00 am - 6:00 pm Sun: 10:00 am - 5:00 pm",,,,,,"http://moundspet.com http://www.moundspet.com","Specialties: Domestic Equipment, Horses, Birds, Small Animals, Small Pets",,,,,,,,