business_x_category.id,business.id,business.ts,business.business_name,business.home_page,business.email_address,business.phone,business.street,business.city,business.state,business.zip_code,business.full_address,business.category,business.rating,business.number_of_reviews,business.bbb_rating_or_license,business.latitude,business.longitude,business.cover_image,business.slogan,business.general_info,business.regular_hours,business.extra_phones,business.services_products,business.payment,business.price_range,business.aka,business.other_links,business.other_information,business.review_1_name,business.review_1_date,business.review_1_rating,business.review_1_text,business.review_2_name,business.review_2_date,business.review_2_rating,business.review_2_text
1080,364,"2020-09-27 02:30:36","International Recycled Products",http://www.tireturf.com,sales@tireturf.com,"(866) 610-0477",,Wixom,MI,48393,"Wixom,MI 48393","Landscaping & Lawn Services, Mulches, Playground Equipment, Rubber Products-Manufacturers, Stone Products",,,,,,,"Install Tire Turf Rubber Mulch one time and your done! Enjoy!",,,"Phone: (810) 347-6688",,,,,"Playground and landscaping rubber mulch manufacturer",,,,,,,,,
1941,622,"2020-09-27 02:30:36","Close The Loop",,info@closetheloop.com,"(570) 629-8414",,Kunkletown,PA,18058,"Kunkletown,PA 18058","Glass-Broken, Fence Materials, Mulches, Plastics & Plastic Products, Rubber Products",,,,,,,,"Offering innovative recycled products: plastic fencing/posts, glass mulch, rubber mulch/landscape timbers and more.",,,,"amex, check, discover, master card, mastercard, paypal, visa",,,,,,,,,,,,
3993,1337,"2020-09-27 02:30:38","International Recycled Products",http://www.tireturf.com,mjdewan67@gmail.com,"(734) 260-0573",,Wixom,MI,48393,"Wixom,MI 48393","Playgrounds, Landscaping Equipment & Supplies, Lawn & Garden Equipment & Supplies-Wholesale & Manufacturers, Mulches, Rubber Products-Manufacturers",,,,,,,"Our Tire Turf Recycled Rubber Mulch keeps your landscaping beautiful and your kids safe on the playground.","We manufacture recycled rubber mulch for landscaping and playgrounds. We manufacture crumb rubber for sport fields and rubber molded products.","Sun Closed","Phone: (248) 669-4771",,,,,http://www.tireturf.com,,,,,,,,,
5638,1924,"2020-09-27 02:30:39","FOREVERMULCHSYSTEMS, LLC.",http://forevermulchsystems.com,forevermulchsystems@gmail.com,"(330) 298-5423","9724 Crow Rd",Litchfield,OH,44253,"9724 Crow Rd,Litchfield,OH 44253","Landscape Designers & Consultants, Landscape Contractors, Mulches, Playgrounds, Rubber Products-Manufacturers",,,,41.18453,-82.03887,,,,"Mon - Fri: 7:30 am - 8:00 pm Sat: 9:00 am - 5:00 pm Sun: 10:00 am - 2:00 pm",,,"cash, all major credit cards, financing available, insurance, check, paypal",,,"The evolution in landscape technology custom",,,,,,,,,
6442,2196,"2020-09-27 02:30:41","US Rubber Mulch LLC",http://www.usrubbermulch.com,Sales@USRubberMulch.com,"(855) 746-3334",,,,,,"Playgrounds, Landscaping Equipment & Supplies, Mulches, Playground Equipment, Rubber Products",,,,,,https://i4.ypcdn.com/blob/e744f1b8f03f3b50258039ffbee6885b3c4ecc93_100x100_crop.jpg?efea793,"The Safest Playgrounds Today, Need PermaLife Pour&Play, and, ""Bias-Ply Tires = No Steel Wires""","If you the best playground fall injury protection on the planet for children, PermaLife Pour&Play is it!","Mon - Fri: 9:00 am - 5:00 pm Sat - Sun Closed","US Rubber Mulch Primary Phone: (855) 746-3334",,"visa, master card, amex, discover, debit, check, paypal, financing available",,,"#1 Safest Play Surfacing Lasts for 25 Years!",,,,,,,,,
7210,2466,"2020-09-27 02:30:41","FlexGround Nevada LLC",http://www.flexground.com,crobertson@flexground.com,"(702) 823-2343","480 Mirror Ct Ste 101",Henderson,NV,89011,"480 Mirror Ct Ste 101,Henderson,NV 89011","Playgrounds, Mulches, Playground Equipment, Rubber Products",,,,36.05921,-115.02534,,"We make playgrounds soft!","FlexGround Nevada LLC installs rubber safety surfacing. We have a wide variety of products to fit any safety surfacing need. FlexGround's surfaces are IPEMA certified and meet guidelines established by the Americans with Disabilities ACT (ADA) and the US Consumer Product Safety Commission (CPSC) assuring peace-of-mind that your playground or water play safety surfacing meets the highest standards.","Mon - Fri: 8:00 am - 4:30 pm","Fax Number: (888) 616-5661",,,,,"FlexGround's Website",,,,,,,,,
338947,111809,"2020-09-27 02:40:59","Sawdust Supply Co.,",http://www.sawdustsupply.com,info@sawdustsupply.com,"(206) 350-0037","6314 7th Ave S",Seattle,WA,98108,"6314 7th Ave S,Seattle,WA 98108","Landscaping & Lawn Services, Automation Systems & Equipment, Building Contractors, Concrete Contractors, Crushed Stone, Environmental & Ecological Consultants, Environmental & Ecological Products & Services, Foundation Contractors, General Contractors, Landscape Contractors, Landscaping Equipment & Supplies, Lawn & Garden Equipment & Supplies, Manufacturing Engineers, Masonry Contractors, Mechanical Engineers, Mulches, Nurseries-Plants & Trees, Oil & Gas Exploration & Development, Paper Manufacturers, Paper Products, Patio Builders, Professional Engineers, Sand & Gravel, Stone Natural, Stone Products, Stone-Retail, Topsoil, Wood Products",5,"1 Review",A+,47.54594,-122.32451,https://i4.ypcdn.com/blob/22f8af8326dddbc1ea61535ae1988b9be9b88202_100x100_crop.jpg?63f80dd,"Locally Owned & Operated, Covering King County","Bark Now Or Forever Hoe Your Weeds. Sawdust Supply Co, Inc. is a bark blowing and landscape supplies distributor serving customers in Seattle, Washington and also serving the surrounding metro area. The landscaping supplies that we use will enhance the look of your landscaping. We will customize our services to accommodate your needs. Do you want to change your current landscaping and you need the necessary materials? If so, our experienced consultants can recommend the services and landscaping supplies that will suit your needs. We'll explain the properties and benefits of various mulch brands and wood chips, and can even create a custom mix. We stock, carry, and supply: Beauti Bark, Nuggets, BeautiGro, BeautiMulch, GroCo and SteerCo Compost Plant mix Topsoil Sawdust, wood chips and play chips Custom mixes What's more, we'll either deliver our quality supplies to you, or you can haul it. Our wide selection of products can be","Mon - Fri: 7:00 am - 5:00 pm Sat: 8:00 am - 4:00 pm Sun Closed",,,"visa, master card, amex, check, discover",,,http://www.sawdustsupply.com,"Parking: Street Bike Parking: Yes Price Range : Average Pets Allowed: Yes",clancy1yeager,08/25/2009,five,"I just found out that Sawdust Supply will accept clean green yard waste for a reasonable price! And once I dump off my yard waste I get the mulch that I need. Great - one stop shopping - I love it.",,,,
339969,112089,"2020-09-27 02:41:05","Williams Fuel & Landscape Supply",http://www.williams-fuel.com,info@williamsfuel.com,"(503) 357-6730","44975 SW Seghers Rd",Gaston,OR,97119,"44975 SW Seghers Rd,Gaston,OR 97119","Paper Products, Building Contractors, Crushed Stone, Garden Centers, Greenhouses, Landscaping Equipment & Supplies, Lawn & Garden Equipment & Supplies, Masonry Contractors, Mulches, Nursery & Growers Equipment & Supplies, Paper Manufacturers, Sand & Gravel, Stone Natural, Stone Products, Stone-Retail, Wood Products",,,A+,45.46503,-123.13957,,"Your Landscape Supply Center","Williams Fuel is your local Landscape supply company which is a family business that was started by Tuffy Williams back in 1946. The business started out back then by selling sawdust from the local mills to those who needed it for their sawdust burners to provide heat for their homes. The business grew from that point started carrying bark dust which was used as a landscape product to keep weeds down. The market also called for firewood as people started trading in their sawdust burners for wood heat. The fuel part of our name stems from that era and in honor of grandpa Tuffy and the name still stands. Through the years Williams Fuel has since turned into a full service landscape supply center. We carry everything you need to get most landscape projects done. Most of our products are in bulk which allow our customers, whether you are a home owner, contractor, farm or nursery to share in the savings. We have a very knowledgeable staff with current owners being here for 10 years. By choosing Williams Fuel to help you with your projects, you are choosing people who actually care and can give you sound proven advice. We are here to help you be successful and happy with your projects. Please call us or stop by today.","Mon - Sat: 8:00 am - 5:00 pm Sun Closed",,,"visa, debit, master card, cash",,,http://www.williams-fuel.com,"Services: Pond Construction",,,,,,,,
348534,114643,"2020-09-27 02:41:15","Schlegel Barkdust",http://www.schlegelbarkdustinc.com,ericsenko17@gmail.com,"(503) 476-3299","2706 SE Tualatin Valley Hwy",Hillsboro,OR,97123,"2706 SE Tualatin Valley Hwy,Hillsboro,OR 97123","Landscape Designers & Consultants, Automation Systems & Equipment, Building Contractors, Concrete Contractors, Crushed Stone, Foundation Contractors, General Contractors, Landscaping & Lawn Services, Manufacturing Engineers, Masonry Contractors, Mechanical Engineers, Mulches, Oil & Gas Exploration & Development, Paper Manufacturers, Paper Products, Patio Builders, Professional Engineers, Sand & Gravel, Stone Natural, Stone Products, Stone-Retail, Topsoil, Wood Products",5,"2 Reviews",A+,45.50354,-122.95514,https://i3.ypcdn.com/blob/bbf839e1c00331243551adc805a9fb5247c5cb23_100x100_crop.jpg?63f80dd,"Always Fresh Barkdust At A Really Great Price, We Deliver Barkdust And Crush Rock To Your Home Or Business","Schlegal Barkdust is located right off of TV HWY, between Beaverton and Hillsboro, right next door to Lowes home improvement. We have been serving our customers for over 10 years with great quality barkdust, crushed Rock sand and gravel. We offer great pricing with all of our products. Schegal Barkdust and rock offers a large variety of Hemlock, Mulch, Fir, and playground bark chips. If you are looking to really spruce up your home or business landscape, stop in and look at the assortment of decorative rock sand and gravel, and drainage crushed rock. We are open to the pubic, landscape design. Call us a call today and Eric will offer free consultation and estimates on your landscaping needs. Ask about our free delivery","Mon - Sat: 9:00 am - 5:00 pm Sun Closed","Phone: (503) 648-5849",,"check, visa, discover, mastercard",,,http://www.schlegelbarkdustinc.com,,"Mike J.",04/09/2013,five,,jaredhelbig,04/23/2010,five,"Fair prices. Great products. Easy to find location right off TV Hwy. .....And they deliver at reasonable rates. I highly recommend Schlegel. Eric is great to work with."
489165,166946,"2020-09-27 02:46:32","MSU Surplus Store & Recycling Ctr.",http://www.msusurplusstore.com,surpluss@msu.edu,"(517) 355-1723","468 Green Way","East Lansing",MI,48824,"468 Green Way,East Lansing,MI 48824","Used Car Dealers, Audio-Visual Equipment, Computers & Computer Equipment-Service & Repair, Farm Equipment, Mulches, Used & Rare Books, Used & Rebuilt Auto Parts, Used Computers, Used Furniture",,,,42.71699,-84.48062,,,,"Mon: 12:00 pm - 3:30 pm Tue: 7:30 am - 5:30 pm Wed - Thu: 12:00 pm - 3:30 pm Fri: 7:30 am - 3:30 pm",,,"mastercard, visa, amex, check, discover",,,"http://www.msusurplusstore.com https://msusurplusstore.com/hours-location","Bike Parking: Yes Parking: Lot, Private",,,,,,,,
623554,221298,"2020-09-27 02:51:42","Boxes & More",http://boxesandmore.biz,tamirivenbark@boxesandmore.biz,"(910) 455-3599","124 Bell Fork Rd",Jacksonville,NC,28540,"124 Bell Fork Rd,Jacksonville,NC 28540","Courier & Delivery Service, Delivery Service, Landscaping Equipment & Supplies, Lawn & Garden Equipment & Supplies, Marine Services, Movers, Moving Boxes, Moving Equipment Rental, Mulches, Packaging Materials, Shipping Room Supplies, Shipping Services, Truck Rental",,,,34.76603,-77.40436,,"We Ship Up To 150 Lbs. In The Usa.","Boxes & More, Inc. is your Jacksonville, NC source for packing and moving supplies, as well as swift package delivery. We offer great service while maintaining that hometown touch! Come to us for: Boxes Packaging service Fax service UPS shipping Overnight service Gift wrapping Package materials All types and sizes of cartons If you are planning a big move, we have the boxes and packing materials you need. Wardrobe boxes, dish packs and mattress boxes will keep everything clean, neat and organized. All the little details are here in one place, too-tape, bubble wrap, markers, packing peanuts-we're your one-stop shop for a smooth move. Call or stop by Boxes & More, Inc. today!","Mon - Fri: 9:00 am - 5:00 pm Sat: 9:00 am - 1:00 pm Sun Closed","Fax: (910) 455-3599",,"master card, visa, cash, amex, discover, all major credit cards",,,http://boxesandmore.biz,,,,,,,,,
699022,241134,"2020-09-27 02:53:42","Dula and son",http://www.dulaandson.com,info@dulaandson.com,"(828) 728-0553","4131 Mountain view circle",Lenoir,NC,28645,"4131 Mountain view circle,Lenoir,NC 28645","Parking Lot Maintenance & Marking, Landscaping Equipment & Supplies, Mulches, Snow Removal Service",,,,35.82149,-81.55137,,,,"Mon - Sat: 7:00 am - 6:00 pm Sun Closed","TollFree: (888) 383-5415",,,,,http://www.dulaandson.com,,,,,,,,,
706487,243397,"2020-09-27 02:53:52","Four Lakes Paving Co Inc",,info@fourlakespaving.net,"(608) 241-8825","5489 Circle Close",Madison,WI,53705,"5489 Circle Close,Madison,WI 53705","Paving Contractors, Asphalt Paving & Sealcoating, Bathroom Remodeling, Building Construction Consultants, Building Contractors, Building Contractors-Commercial & Industrial, Business Coaches & Consultants, Driveway Contractors, General Contractors, Heating Contractors & Specialties, Mulches, Parking Lot Maintenance & Marking, Parking Stations & Garages-Construction, Physicians & Surgeons, Physicians & Surgeons, Urology, Plumbers, Plumbing-Drain & Sewer Cleaning, Sewer Cleaners & Repairers, Sewer Cleaning Equipment & Supplies, Sewer Contractors, Snow Removal Service, Utility Contractors, Water Filtration & Purification Equipment, Water Heater Repair, Water Heaters, Water Softening & Conditioning Equipment & Service, Water Treatment Equipment-Service & Supplies",5,"1 Review",A+,43.072998,-89.45282,,,"Proudly Serving Madison and the Surrounding Area Since 1995 We?re 4 Lakes Plumbing, and we're glad to serve the Madison and surrounding area with fast, reliable and guaranteed service for all of your plumbing needs. We provide residential and commercial service, repairs and installation. We represent Moen, Kohler and Insinkerator products, and stand behind our products 110%. When you call us, you will always get a live, friendly person on the other line, not a machine or a computer. We offer in-house financing, and don't forget to ask about our senior's discount. Have an emergency? If you have a plumbing emergency (there?s nothing worse than coming home to find a water leak?or worse, flood), call our service number and we?we'll get someone out as soon as possible, often within the hour. Our service You can expect our servicemen to be professional and courteous, to always make sure your questions are answered, and to do the highest quality work. We offer free estimates, and we?re confident you?'you'll find our prices to be incredibly reasonable. We?re specialists in the service and installation of plumbing systems for both residential and commercial properties. Our guarantee We guarantee that you?'you'll be satisfied with the work we do. Should any of our products fail within a year of service, we?'we'll fix them for you at no charge. Set up your service call today. We look forward to working with you. We?re the area?s plumbing specialists ? quality and customer satisfaction are our top priorities. Our wide range of products and services include: 1.Major and Minor Remodeling 2.New Construction (Residential & Commercial) 3.Hot Water Heaters (Gas & Electric) 4.Water Softeners (Rental Options) 5.Repairs 6.Re-piping 7.Low Water-Pressure Problems 8.Leaks and Drips 9.Faucets 10.Toilets 11.Clogged Water Lines 12.Copper Repiping We provide both Residential and Commercial Services. Customers Served Residential, Commercial, Industrial","Mon - Fri: 7:30 am - 5:00 pm","Phone: (608) 241-5184",,"mastercard, visa",,"4 Lakes Plumbing Inc",,,"Kim O.",06/03/2015,five,"4 Lakes Plumbing is great! They installed a new shower fixture in our old claw foot tub and fixed the leak too. We love our new shower! Highly recommended. Thanks! - Kim and Brian",,,,
710745,244756,"2020-09-27 02:54:01","East Coast Pro Landscaping",http://eastcoastprolandsc.wix.com/eastcoastpro,eastcoastprolandscaping@gmail.com,"(843) 779-6031","2229 Blue Moon Ct",Loris,SC,29569,"2229 Blue Moon Ct,Loris,SC 29569","Landscaping & Lawn Services, Construction Site-Clean-Up, Mulches, Parking Lot Maintenance & Marking, Sweeping Service-Power",,,,33.98834,-78.92623,https://i3.ypcdn.com/blob/f084c26f9460e187f704b2bdaa3cd65ab63c253c_100x100_crop.jpg?63f80dd,,,"Mon - Fri: 8:00 am - 6:00 pm Sat: 8:00 am - 12:00 pm Sun Closed","Office: (843) 779-6031 Office Voice Mail: (843) 779-6030",,"debit, check, cash, all major credit cards",,,Landscaping,,,,,,,,,
725800,249560,"2020-09-27 02:54:32","Professional Lawn Service",http://professionallawnservice.net,dpeevy151@yahoo.com,"(731) 695-6643","515 Tige Hopper Rd",Jackson,TN,38305,"515 Tige Hopper Rd,Jackson,TN 38305","Lawn Maintenance, Fertilizing Services, Landscape Contractors, Landscape Designers & Consultants, Landscaping & Lawn Services, Lawn Mowers, Mulches, Parking Lots & Garages, Snow Removal Service",,,,35.78142,-88.62128,,"The Very Best in Residential and Commercial Lawn Care and Landscaping","Professional Lawn Service gives you the very best in residential and commercial lawn care. Professional Lawn Service does it all, from lawn care and landscape installations to maintenance and basic gardening. We have many years of experience bringing you the most beautiful lawns imaginable at the guaranteed fairest prices. For the best in creative landscaping design and detailed commercial and home landscape maintenance, give Professional Lawn Service a call, we can provide all the needed services. Our professional landscape team provides elaborate design, sales, installation and maintenance for your lawn and garden. Looking To Remodel Your Current Landscape? Then Contact Us For Professional Lawn Care & Landscaping Services Today!","Mon - Fri: 8:00 am - 5:00 pm",,,"amex, discover, visa, all major credit cards",,,http://professionallawnservice.net,,,,,,,,,
728554,250433,"2020-09-27 02:54:43","Noe's Lawn & Landscaping Inc",http://noeslandscaping.net,noeslawn@aol.com,"(630) 631-2583","604 Rockhurst Rd",Bolingbrook,IL,60440,"604 Rockhurst Rd,Bolingbrook,IL 60440","Landscaping Equipment & Supplies, Erosion Control, Hydroseeding, Lawn Maintenance, Mulches, Parking Lot Maintenance & Marking, Snow Removal Service, Weed Control Service",,,A+,41.70679,-88.04304,,,"Your Natural solution for every season","Mon - Fri: 8:00 am - 5:00 pm Sat: 9:00 am - 1:00 pm",,,"cash, check, master card, visa",,"Noe's Lawn & Landscaping Corp Noe's Lawn and Landscaping",http://noeslandscaping.net,"Services: Lawn Maintenance",,,,,,,,
948499,311092,"2020-09-27 03:01:01","Royalty Services",http://www.royaltyservicesinc.com,matt@royaltyservicesinc.com,"(810) 214-0738","11339 Silver Lake Rd",Byron,MI,48418,"11339 Silver Lake Rd,Byron,MI 48418","Landscape Designers & Consultants, Building Contractors, Concrete Contractors, Crushed Stone, Foundation Contractors, General Contractors, Landscape Contractors, Landscaping & Lawn Services, Landscaping Equipment & Supplies, Lawn & Garden Equipment & Supplies, Lawn Maintenance, Masonry Contractors, Mulches, Retaining Walls, Sand & Gravel, Sprinklers-Garden & Lawn, Stone Cutting, Stone Natural, Stone Products, Stone-Retail, Stoneware, Topsoil",,,,42.8112,-83.89441,https://i1.ypcdn.com/blob/138e3c44cc07c4ce0ecc7bca532a615e4b984f54_100x100_crop.jpg?f9d23e1,"Your home town landscape supplier","Royalty Services is a family owned professional landscaping design & maintenance company. We have proudly served Genesee and surrounding areas since 1994. We are a full service lawn care company along with irrigation and snow plow services. We handle everything from a simple lawn mow to an entire new landscaping design project and everything in between. In the winter months when our beautiful landscaping is covered in snow we help keep up the maintenance on your yard and pathways as well. Royalty Services has a highly experienced and trained crew with years of experience in landscaping, irrigation and fertilization. One of the most important factors when creating a beautiful landscape is maintaining it. We can install and repair irrigations systems. An irrigation system is the easiest way to maintain the beauty of a landscape. If you are thinking about installing an irrigation system and have questions or would like a free estimate give us a call at 810-266-6866.","Mon - Fri: 8:00 am - 5:00 pm Sat: 8:00 am - 2:00 pm Sun Closed","Fax: (810) 266-5888",,"visa, amex, cash, check, debit, discover, master card",,,http://www.royaltyservicesinc.com,"Services: Landscape Designers, Lawn Maintenance",,,,,,,,
948658,311132,"2020-09-27 03:01:01","Lentz Landscaping Inc",,,"(262) 835-1220","7725 State Road 38",Caledonia,WI,53108,"7725 State Road 38,Caledonia,WI 53108","Landscaping Equipment & Supplies, Building Materials, Garden Centers, Hardware Stores, Landscape Contractors, Landscaping & Lawn Services, Masonry Equipment & Supplies, Mulches, Sand & Gravel, Stone Natural",,,A+,42.82497,-87.91377,https://i1.ypcdn.com/blob/7e12b6b26d5a09762eaf7b4601483eb6af0385f9_100x100_crop.jpg?f9d23e1,,,,,,,,,,"Services: Landscape Lighting",,,,,,,,
948872,311181,"2020-09-27 03:01:01","Beaver Dam Landscape Supply",http://www.beaverdamlandscapesupply.com,bdlandscapesupply@gmail.com,"(920) 296-7332","N8559 State Road 33","Beaver Dam",WI,53916,"N8559 State Road 33,Beaver Dam,WI 53916","Retaining Walls, Landscaping Equipment & Supplies, Mulches, Stone Natural, Topsoil",5,"1 Review",,43.50474,-88.85451,,,"We have been proudly serving Beaver Dam, Dodge County and surrounding areas for over 24 years with our family owned excavating business. In 2010 we opened Beaver Dam Landscape Supply, located between Fox Lake and Beaver Dam on State Rd. 33. It is our years of excavating experience that helps us help our customers in doing their own outdoor projects. Because the business is run by the owner, we are commited to helping you on a personal level.","Mon - Fri: 8:00 am - 5:00 pm Sat: 8:00 am - 2:00 pm Sun Closed",,,"master card, visa, discover, check, diners club, cash",,,http://www.beaverdamlandscapesupply.com,"Parking: Lot",michael8777,02/15/2013,five,,,,,
948967,311202,"2020-09-27 03:01:01","L H Voss Materials",http://www.lhvoss.com/,nyoka.corley@gmail.com,"(925) 241-5246","5965 Dougherty Rd",Dublin,CA,94568,"5965 Dougherty Rd,Dublin,CA 94568","Stone Natural, Building Materials, Garden Centers, Landscaping Equipment & Supplies, Lawn & Garden Equipment & Supplies, Mulches, Ready Mixed Concrete, Rock Shops, Sand & Gravel, Stamped & Decorative Concrete, Stone Products, Topsoil",,,A+,37.70689,-121.9099,https://i1.ypcdn.com/blob/04c1574f751ecac444e0eb84e3903cd63a9e2e10_100x100_crop.jpg?f9d23e1,,,"Mon - Fri: 7:00 am - 5:00 pm Sat: 7:30 am - 4:00 pm Sun Closed",,,"master card, visa, amex, diners club",,,"http://www.lhvoss.com http://lhvoss.com","Parking: Lot, Private Bike Parking: Yes Wheelchair Accessible: Yes Pets Allowed: Yes Services: Install Sod, Sand Delivery",,,,,,,,