business_x_category.id,business.id,business.ts,business.business_name,business.home_page,business.email_address,business.phone,business.street,business.city,business.state,business.zip_code,business.full_address,business.category,business.rating,business.number_of_reviews,business.bbb_rating_or_license,business.latitude,business.longitude,business.cover_image,business.slogan,business.general_info,business.regular_hours,business.extra_phones,business.services_products,business.payment,business.price_range,business.aka,business.other_links,business.other_information,business.review_1_name,business.review_1_date,business.review_1_rating,business.review_1_text,business.review_2_name,business.review_2_date,business.review_2_rating,business.review_2_text
694056,239554,"2020-09-27 02:53:25","Hailstorm Solutions",http://hailstormsolutions.com,headth@aol.com,"(619) 540-5731","9402 Wheatlands CT",Santee,CA,92071,"9402 Wheatlands CT,Santee,CA 92071","Industrial Cleaning, Building Construction Consultants, Building Contractors, Cleaning Contractors, Concrete Contractors, Concrete Restoration, Sealing & Cleaning, Construction Consultants, Fire & Water Damage Restoration, General Contractors, House Cleaning, Mold Remediation, Mold Testing & Consulting, Parking Lot Maintenance & Marking, Parking Stations & Garages-Construction, Sandblasting",,,,32.84702,-116.96219,,"Serving San Diego, Los Angeles, Riverside and All Southern California Since 2008.","Hailstorm blasting utilizes the latest in mobile blasting equipment and media to handle any of your industrial cleaning needs. Sandblasting, paint preparation, dry ice blast cleaning, smoke and fire damage, mold remediation, parking stripe removal, industrial equipment cleaning, rust, lead etc. Hailstorms management team has owned, operated and maintained various manufacturing and distribution facilities for more than 30 years. Hailstorm Industrial cleaning solutions company was created in 2008 with the idea of providing customers with cleaning solutions, that solve many of the cleaning and maintenance challenges faced by manufacturing, restoration, Insurance and facility operation managers and companies. Our knowledge of facility operations gives Hailstorm Industrial cleaning solutions company, greater insight to the need for a variety of technologies that are both green, safe and effective, as well as the importance of coordinating our work with our customers in such a way to allow for the least amount of down time and business disruption. Our Ceiling Pro technology is backed by 24 years of proprietary solutions development and Industrial cleaning expertise.","Mon - Sat: 9:00 am - 5:00 pm",,,"insurance, all major credit cards, check",,,http://hailstormsolutions.com,,,,,,,,,
734046,252277,"2020-09-27 02:55:01","Black Construction",http://realpages.com/sites/blackconstruction/page3.html,cdblack@memphis.edu,"(901) 486-7376","5991 Elmore Rd",Memphis,TN,38134,"5991 Elmore Rd,Memphis,TN 38134","General Contractors, Building Contractors, Electricians, Environmental & Ecological Consultants, Mold Remediation, Mold Testing & Consulting, Parking Lot Maintenance & Marking, Parking Stations & Garages-Construction",,,,35.19003,-89.8635,,,"We have recently acquired a street sweeper for parking lot clean up. Contact us for a free estimate on our recurring programs.","Mon - Sun: Open 24 Hours",,,,,,http://realpages.com/sites/blackconstruction/page3.html,"Services: Moss Removal",,,,,,,,
950697,311575,"2020-09-27 03:01:01","Tanin Carpet Cleaning & Water Damage, Mold Removal Arlington Hts",http://www.tanincarpetcleaning.com/carpetcleaning/carpet-cleaning-arlingtonheights.html,,"(847) 345-4774","1400 E Lillian Ave","Arlington Heights",IL,60004,"1400 E Lillian Ave,Arlington Heights,IL 60004","Floor Materials, Carpet & Rug Cleaners-Water Extraction, Carpet & Rug Dealers, Fire & Water Damage Restoration, Floor Waxing, Polishing & Cleaning, Marble & Terrazzo Cleaning & Service, Mold Remediation, Mold Testing & Consulting, Power Washing, Tile-Cleaning, Refinishing & Sealing, Upholstery Cleaners, Water Damage Emergency Service, Water Damage Restoration",5,"11 Reviews",,42.1087,-87.96597,https://i1.ypcdn.com/blob/fb61e0e2d762ad9b27d7a66c357751bd38828389_100x100_crop.jpg?f9d23e1,,,"Mon - Sun: Open 24 Hours","Phone: (847) 345-4438",,"all major credit cards, check, debit",,,http://www.tanincarpetcleaning.com/carpetcleaning/carpet-cleaning-arlingtonheights.html,,"Richard M.",02/15/2013,five,,"YPMobile User",02/15/2013,five,
965471,314895,"2020-09-27 03:01:22","Tanin Carpet Cleaning, Water Damage & Mold Remediation",http://www.tanincarpetcleaning.com/carpetcleaning/carpet-cleaning-palatine.html,,"(224) 836-5843","429 N Cambridge Dr",Palatine,IL,60067,"429 N Cambridge Dr,Palatine,IL 60067","Marble & Terrazzo Cleaning & Service, Carpet & Rug Cleaners, Carpet & Rug Cleaners-Water Extraction, Floor Waxing, Polishing & Cleaning, Mold Remediation, Mold Testing & Consulting, Power Washing, Tile-Cleaning, Refinishing & Sealing, Upholstery Cleaners, Water Damage Emergency Service, Water Damage Restoration",5,"10 Reviews",,42.11835,-88.06422,https://i1.ypcdn.com/blob/b3cc748bee36f1ac9fa63b8c9d6dde966e051a43_100x100_crop.jpg?f9d23e1,,,"Mon - Fri: 7:00 am - 11:30 pm Sat - Sun: 8:00 am - 11:30 pm",,,"debit, all major credit cards, check",,,http://www.tanincarpetcleaning.com/carpetcleaning/carpet-cleaning-palatine.html,,"Richard M.",02/15/2013,five,,"YPMobile User",02/15/2013,five,
1238223,397347,"2020-09-27 03:09:21","Katch Environmental Inc.",http://www.katchenvironmental.com,paul@katchenvironmental.com,"(559) 292-6653","4972 E Pontiac Way",Fresno,CA,93727,"4972 E Pontiac Way,Fresno,CA 93727","Mold Remediation, Asbestos Detection & Removal Services, Building Contractors, Contractors Equipment & Supplies, Demolition Contractors, Excavation Contractors, Fire & Water Damage Restoration, Garbage & Rubbish Removal Contractors Equipment, Hazardous Material Control & Removal, Lead Paint Detection & Removal, Mold Testing & Consulting, Trash Containers & Dumpsters, Water Damage Restoration",,,A+,36.78949,-119.70904,,,,"Mon - Fri: 8:00 am - 5:00 pm",,,,,,http://www.katchenvironmental.com,,,,,,,,,
1576305,493242,"2020-09-27 03:18:59","Paul Davis Restoration",,jingold@pdr-usa.net,"(352) 307-2222","12331 SE Us Highway 441",Belleview,FL,34420,"12331 SE Us Highway 441,Belleview,FL 34420","Mold Remediation, Altering & Remodeling Contractors, Building Contractors, Cabinet Makers, Cabinets, Fire & Water Damage Restoration, General Contractors, Hazardous Material Control & Removal, Home Improvements, Home Repair & Maintenance, Mold Testing & Consulting, Water Damage Restoration",,,,29.04318,-82.03144,,,,"Mon - Sun: Open 24 Hours",,,,,,,"Services: Fire Damage Restoration, Water Damage Restoration",,,,,,,,
1576747,493322,"2020-09-27 03:18:59","Pro Coats Hawaii Inc",http://c.ypcdn.com/2/c/rtd?vrid=th040m75qn&rid=f0ce2e95-9e3d-40ca-9d61-5291cdebfeff&ptid=th040m75qn&ypid=473071627&lid=1000398684040&tl=6&lsrc=LB&dest=http%3A%2F%2Fwww.procoatshawaii.com,,"(808) 821-2180","6308 Kaahele St",Kapaa,HI,96746,"6308 Kaahele St,Kapaa,HI 96746","Water Damage Restoration, Building Contractors, General Contractors, Home Improvements, Mold Remediation, Mold Testing & Consulting, Pressure Washing Equipment & Services, Water Damage Emergency Service",,,,22.05483,-159.37582,,,,"Mon - Fri: 7:00 am - 7:00 pm","Phone: (808) 639-3023 Phone: (808) 821-2080 Fax: (808) 821-2182",,"visa, master card",,,"http://c.ypcdn.com/2/c/rtd?vrid=th040m75qn&rid=f0ce2e95-9e3d-40ca-9d61-5291cdebfeff&ptid=th040m75qn&ypid=473071627&lid=1000398684040&tl=6&lsrc=LB&dest=http%3A%2F%2Fwww.procoatshawaii.com http://www.procoatshawaii.com",,,,,,,,,
1592012,495769,"2020-09-27 03:19:11","Phoenix Restoration & Renovation",http://phoenixrestorationandrenovation.com,cs@phxrar.com,"(410) 925-8300","2310 Putnam Rd","Forest Hill",MD,21050,"2310 Putnam Rd,Forest Hill,MD 21050","Water Damage Restoration, Altering & Remodeling Contractors, Carpet & Rug Cleaners, Fire & Water Damage Restoration, General Contractors, Handyman Services, Home Improvements, Mold Remediation, Mold Testing & Consulting",,,A+,39.55237,-76.44856,,,"24 hour emergency response water extraction carpet cleaning carpet installation water damage restorative services reconstruction.","Mon - Sun: 6:00 am - 6:00 pm","TollFree: (800) 770-5145",,,,"Phoenix Restoration And Renovation, Inc.",http://phoenixrestorationandrenovation.com,,,,,,,,,
1602110,497415,"2020-09-27 03:19:17","First Restoration Services",http://www.frs247.com,info@firstrestorationwnc.com,"(828) 398-4048","173 Rutledge Rd",Fletcher,NC,28732,"173 Rutledge Rd,Fletcher,NC 28732","House Cleaning, Cleaning Contractors, Fire & Water Damage Restoration, Home Improvements, Home Repair & Maintenance, Kitchen Planning & Remodeling Service, Mold Remediation, Mold Testing & Consulting, Smoke Odor Counteracting Service, Water Damage Emergency Service, Water Damage Restoration",,,A+,35.44029,-82.52409,https://i1.ypcdn.com/blob/a291ff552636a0f5c9d69accd801db34fed00f5f_100x100_crop.jpg?f832250,"Disasters Happen. We take care of them all.","First Restoration Services is a full service restoration company. Our services range from cleanup to reconstruction to crime scene cleanup. It is our mission to always successfully complete your project correctly the first time and to prevent the possibility for secondary damage. First Restoration Services has put a lot of time and money into making sure we have the most educated staff with the best available technology. Every employee has undergone a criminal background check, pre-hire and random drug testing and must have clean driving history to be able to operate our vehicles. First Restoration Services employees arrive on time, in uniform (which includes photo ID tag) and are in clean recognizable vehicles. Put your trust in the most experienced and qualified restoration company in Western North Carolina.","Mon - Sun: Open 24 Hours",,,"all major credit cards",,,http://www.frs247.com,"Services: Fire Damage Restoration",,,,,,,,
1605802,498034,"2020-09-27 03:19:18","Crown Remodeling",https://www.crownremodelingllc.com,info@crownremodelingllc.com,"(410) 861-0039","5 Gwynns Mill Ct Ste A","Owings Mills",MD,21117,"5 Gwynns Mill Ct Ste A,Owings Mills,MD 21117","Altering & Remodeling Contractors, Construction Consultants, Deck Builders, Gutters & Downspouts, Home Improvements, Mold Testing & Consulting, Patio Builders, Roofing Contractors, Siding Contractors, Windows, Windows-Repair, Replacement & Installation",,,A+,39.4143,-76.78061,,,,"Mon - Sat: 9:00 am - 5:00 pm",,,"cash, discover, master card, visa",,"Crown Remodeling LLC",https://www.crownremodelingllc.com,,,,,,,,,
1617884,500044,"2020-09-27 03:19:30","Absolute Restoration & Water",http://www.absolute-plumbing.com,absoluterestoration911@yahoo.com,"(224) 399-9934","38045 N Cornell Rd","Beach Park",IL,60087,"38045 N Cornell Rd,Beach Park,IL 60087","Water Damage Restoration, Altering & Remodeling Contractors, Building Contractors, Carpet & Rug Dealers, Carpet & Rug Repair, Fire & Water Damage Restoration, General Contractors, Home Improvements, Home Repair & Maintenance, Mold Remediation, Mold Testing & Consulting",,,,42.41436,-87.85216,,,,"24 Hours Emergency","Phone: (847) 220-5112 Phone: (224) 338-9804",,"all major credit cards, discover, master card, visa, amex, cash, check",,"Absolute Restoration & Water Damage Absolute Restoration 911","http://www.absolute-plumbing.com http://absoluteplumbingil.com",,,,,,,,,
1620949,500544,"2020-09-27 03:19:31","His and Hers Realty, LLC.",,hisandhersrealty@gmail.com,"(330) 209-5008","2314 Tuscarawas St E",Canton,OH,44707,"2314 Tuscarawas St E,Canton,OH 44707","Home Improvements, Bathroom Remodeling, Building Contractors, Cabinet Makers, Cabinets, Carpenters, Concrete Contractors, Deck Builders, Flooring Contractors, Foundation Contractors, General Contractors, Hazardous Material Control & Removal, Home Repair & Maintenance, Kitchen Planning & Remodeling Service, Masonry Contractors, Mold Remediation, Mold Testing & Consulting, Patio Builders",,,A+,40.79214,-81.34529,,"Quality work with a personal touch!","His and Hers Realty, LLC. is a local family owned and operated business. Serving Canton Ohio and the surrounding communities. His and Hers Realty will handle your interior construction needs with that personal touch second to none. Mark and Danielle have over twenty five years experience combined in the construction trades and in real estate restoration. Specializing in the following areas: Home interior remodeling, kitchen and bathroom remodeling, mold inspection and mediation, deck building, framing, and flooring. Licensed and insured call His and Hers Realty, LLC. for your free quote!","Mon - Fri Closed Sat - Sun: 9:00 am - 9:00 pm",,,"check, money order, travelers checks, cash",,,,,,,,,,,,
1624796,501147,"2020-09-27 03:19:40","Disaster Restoration Squad Inc",http://www.disasterrestoration.pro,office@disasterrestorationsquad.com,"(239) 334-0593","5683 Corporation Cir Fl 33905","Fort Myers",FL,33905,"5683 Corporation Cir Fl 33905,Fort Myers,FL 33905","Water Damage Restoration, Building Contractors, Fire & Water Damage Restoration, General Contractors, Home Improvements, Mold Remediation, Mold Testing & Consulting, Water Damage Emergency Service",5,"3 Reviews",,26.66205,-81.80145,https://i3.ypcdn.com/blob/307fda0b0c0ae6bba52b090155b6ad3110174597_100x100_crop.jpg?f832250,,,"Mon - Fri: 8:00 am - 4:00 pm Sat - Sun Closed","Phone: (239) 267-6616 Primary Phone: (239) 267-6616 TollFree: (866) 635-7319",,"amex, visa, all major credit cards, discover, mastercard",,"Custom Plastering & Stucco Inc Disaster Restoration Squad Inc Fort-Myers","http://www.disasterrestoration.pro https://www.custompr.pro http://www.disasterrestorationsquad.com http://disasterrestorationservicespa.com",,sjonah,11/11/2009,five,"Thanks to Disaster Restoration Squad, a very tough time was made much easier! Their staff was more than professional, curtious and friendly! I would recommend them to any of my family and friends! THANK YOU DISASTER RESTORATION SQUAD!!",wallenworld1,09/27/2009,five,"Very prompt and professional. I would recommend DRS to anybody."
1634780,502817,"2020-09-27 03:19:43","West Michigan Restorations",,,"(616) 288-7751","88 54th St SW Unit 104","Grand Rapids",MI,49548,"88 54th St SW Unit 104,Grand Rapids,MI 49548","Water Damage Restoration, Altering & Remodeling Contractors, Fire & Water Damage Restoration, General Contractors, Home Improvements, Mold Remediation, Mold Testing & Consulting",,,,42.86529,-85.66612,,,,,"Fax: (616) 288-7749",,,,"West Michigan Restorations LLC",,,,,,,,,,
1647000,504867,"2020-09-27 03:19:59","Four Corners Restoration",,tracy@fourcornersne.com,"(402) 916-0017","14015 Industrial Rd",Omaha,NE,68144,"14015 Industrial Rd,Omaha,NE 68144","Water Damage Restoration, Altering & Remodeling Contractors, Carpet & Rug Cleaners, Fire & Water Damage Restoration, Home Improvements, Mold Remediation, Mold Testing & Consulting, Smoke Odor Counteracting Service",,,A,41.22053,-96.13217,,,,"Mon - Sun: 12:00 am - 11:59 pm",,,,,,,,,,,,,,,
1651795,505682,"2020-09-27 03:20:10","Environmental Property Solutions",http://epsiowa.com,chuck@epsiowa.com,"(515) 518-1019","10582 Justin Dr",Urbandale,IA,50322,"10582 Justin Dr,Urbandale,IA 50322","Hazardous Material Control & Removal, Altering & Remodeling Contractors, Asbestos Consulting & Testing, Asbestos Detection & Removal Services, Building Contractors, Cabinet Makers, Cabinets, General Contractors, Home Improvements, Home Repair & Maintenance, Mold Remediation, Mold Testing & Consulting",,,A+,41.62396,-93.76409,,"Professional Asbestos And Mold Abatement.","Environmental Property Solutions or EPS, is an Iowa certified asbestos abatement contractor in active and good standing with both the Iowa OSHA department and DNR. We strive to provide efficient and effective solutions to where asbestos, mold remediation, and other environmental problems are an issue. We have professionally trained consultants to assist you. Call us and we will assess the situation for you.","Mon - Fri: 7:00 am - 5:00 pm Sat - Sun Closed",,,"cash, check",,,http://epsiowa.com,,,,,,,,,
1654028,506069,"2020-09-27 03:20:21","REO Construction Co",,m.parmelee@comcast.net,"(734) 887-6142","34902 Forest St",Wayne,MI,48184,"34902 Forest St,Wayne,MI 48184","Home Improvements, Building Contractors, Drywall Contractors, Fire & Water Damage Restoration, Home Repair & Maintenance, Inspection Service, Mold Remediation, Mold Testing & Consulting, Painting Contractors, Water Damage Restoration",,,A+,42.27742,-83.38218,,"A full service home improvement company","REO Construction Company has been in business since 1995, providing our clients with professional and cost efficient home repairs and improvements. Using a common sense approach, we are committed to providing an honest and fair assessment of the repairs or improvements and performing our service at a fair price. Our years of experience,and credentials earned, uniquely qualify us to repair your home or business.","Mon - Sun: Open 24 Hours","Russell Drouillard: (734) 260-3410 Michael Parmelee: (734) 216-2033 Fax: (734) 895-7251",,"visa, master card, check, paypal, insurance",,"Michael Parmelee Painting, Inc.",http://www.reoconstruction.com,"Parking: Self",,,,,,,,
1657447,506626,"2020-09-27 03:20:21","Premier Home Inspections of New York",,premierhomeny1@aol.com,"(631) 484-6567","412 Terryville rd","Port Jefferson station",NY,11776,"412 Terryville rd,Port Jefferson station,NY 11776","Home Improvements, Inspection Service, Mold Testing & Consulting, Termite Control",,,,40.90747,-73.05182,,,"Perform certified home inspections residential and commercial. Mold inspection and termite inspections.","Mon - Fri: 6:30 am - 8:00 pm Sat: 8:00 am - 9:00 pm Sun: 8:00 am - 7:00 pm","office: (631) 642-7376",,"check, paypal, cash, all major credit cards",,,,,,,,,,,,
1676544,509768,"2020-09-27 03:20:41","Protechs Inc",http://www.protechsinc.com,protechs@protechsinc.com,"(574) 267-6755","1631 Armstrong Rd",Warsaw,IN,46580,"1631 Armstrong Rd,Warsaw,IN 46580","Home Improvements, Altering & Remodeling Contractors, Antique Repair & Restoration, Automobile Upholstery Cleaning, Board Up Service, Building Cleaning-Exterior, Building Contractors, Building Maintenance, Cabinet Makers, Cabinets, Carpet & Rug Cleaners, Carpet & Rug Cleaners-Water Extraction, Cleaning Contractors, Commercial & Industrial Steam Cleaning, Crime & Trauma Scene Clean Up, Disaster Preparedness Service, Disaster Recovery & Relief, Drapery & Curtain Cleaners, Fire & Water Damage Restoration, Floor Waxing, Polishing & Cleaning, General Contractors, Hazardous Material Control & Removal, Home Repair & Maintenance, Hospital Equipment & Supplies, House Cleaning, Industrial Cleaning, Janitorial Service, Medical Equipment & Supplies, Mold Remediation, Mold Testing & Consulting, Ultrasonic Equipment & Supplies, Water Damage Emergency Service, Water Damage Restoration",,,,41.24103,-85.88078,https://i1.ypcdn.com/blob/b06a812a8e0f96ae32e06a5247c62bfcf09eef55_100x100_crop.jpg?f832250,"Where Quality Comes First.","Protechs Inc is a water, fire, and wind damage restoration company serving Warsaw, ID and the surrounding areas. At Protechs Inc, our most important job is always yours. Our customers know that our service is actually an investment, an assurance they are receiving the best possible care for their possessions. We pride ourselves on taking care of the customer first and this translates into being your number one resource from carpet cleaning to fire to water restoration. We offer free consultations because every job is unique. This gives us the opportunity to analyze your situation and offer suggestions on what we can do for your cleaning and restoration needs. We are one of six ASCR certified restorers in Indiana. Our entire staff is OSHA certified. Call Protechs Inc today and we'll take care of you.","Mon - Sun: Open 24 Hours",,,"discover, master card, visa",,,http://www.protechsinc.com,"Wheelchair Accessible: Yes",,,,,,,,
1679550,510268,"2020-09-27 03:20:49","Flood Pros USA",http://floodprosusa.com,kristy@floodprosusa.com,"(770) 242-3916","1264 Concord Rd SE Ste 203",Smyrna,GA,30080,"1264 Concord Rd SE Ste 203,Smyrna,GA 30080","Water Damage Restoration, Fire & Water Damage Restoration, Home Improvements, Home Repair & Maintenance, Mold Remediation, Mold Testing & Consulting, Water Damage Emergency Service",,,A+,33.87926,-84.51726,https://i1.ypcdn.com/blob/e32df70aa98f7ea324bfb4172bed8810c5192db3_100x100_crop.jpg?f832250,,"Since 2015, Flood Pros USA has been providing homeowners and businesses with professional water, fire, and smoke restoration and mold remediation to help them restore their properties and get them back to their daily routines as quickly as possible. Our dedication to quality service has earned us accreditation from the Better Business Bureau, and as a certified firm with the Institute of Inspection, Cleaning, and Restoration Certification, our team stays up-to-date on the latest damage restoration techniques and procedures. We are dedicated to taking care of our customers and are proud of our commitment to building trust and understanding.","Mon - Sun: Open 24 Hours","TollFree: (800) 250-4918",,"amex, cash, check, discover, master card, visa",,,website,,,,,,,,,
1689415,511911,"2020-09-27 03:20:50","Jenkins Inspections",,JenkinsLLP2016@gmail.com,"(234) 347-0632","2323 Donner St NW","North Canton",OH,44720,"2323 Donner St NW,North Canton,OH 44720","Home Improvements, Mold Testing & Consulting, Real Estate Inspection Service",,,,40.91567,-81.38717,,,"We are a family owned business that specializes in general home inspections and mold testing. We also install laminate, LVT, hardwoods, vinyl and carpet flooring. We service all of Stark county and surrounding cities.","Mon - Fri: 8:00 am - 5:00 pm",,,check,,,,,,,,,,,,
1702306,514017,"2020-09-27 03:21:06","Premier Environmental LLC",,,"(720) 370-9524","536 Nucla Way",Aurora,CO,80011,"536 Nucla Way,Aurora,CO 80011","Home Improvements, Asbestos Consulting & Testing, Asbestos Detection & Removal Services, Mold Remediation, Mold Testing & Consulting",,,,39.72426,-104.79391,,,,"Mon - Sun: Open 24 Hours",,,,,,,,,,,,,,,
1707285,514881,"2020-09-27 03:21:06","Unbiased Mold Testing",http://www.unbiasedmoldtesting.com,,"(202) 350-0106","1220 L St NW Ste 100-314",Washington,DC,20005,"1220 L St NW Ste 100-314,Washington,DC 20005","Home Improvements, Mold Remediation, Mold Testing & Consulting",,,,38.90338,-77.02913,,,,"Mon - Sun: 8:00 am - 8:00 pm",,,"all major credit cards",,,http://www.unbiasedmoldtesting.com,,,,,,,,,