business_x_category.id,business.id,business.ts,business.business_name,business.home_page,business.email_address,business.phone,business.street,business.city,business.state,business.zip_code,business.full_address,business.category,business.rating,business.number_of_reviews,business.bbb_rating_or_license,business.latitude,business.longitude,business.cover_image,business.slogan,business.general_info,business.regular_hours,business.extra_phones,business.services_products,business.payment,business.price_range,business.aka,business.other_links,business.other_information,business.review_1_name,business.review_1_date,business.review_1_rating,business.review_1_text,business.review_2_name,business.review_2_date,business.review_2_rating,business.review_2_text
14560,5958,"2020-09-27 02:30:57","Seaside Associates",,info@seasideassociates.com,"(603) 766-3480","1262 Woodbury Ave",Portsmouth,NH,03801,"1262 Woodbury Ave,Portsmouth,NH 03801","Employment Contractors, Employment Agencies, Talent Agencies, Temporary Employment Agencies",,,,43.08482,-70.7876,,"Excellence in Staffing....Proven","Seaside Associates is a premier supplier of temporary, temp to perm and permanent placement services for businesses on the seacoast of NH, southern NH and north shore area of Boston. Seaside Associates can provide, clerical, office, financial, engineering, technical and managerial/supervisory personnel to help you grow your business. Seaside Associates can also provide staff for medical manufacturing, electronics manufacturing, electrical box building, wire harness building, food processing machinists, machine operators and general labor. Seaside Associates can and will customize recruiting and orientation of candidates to ensure that the client will enjoy the positive benefits of a staff that will fulfill the expectations and business objectives of the management team.","Mon - Fri: 8:30 am - 5:00 pm Sat - Sun Closed","Phone: (603) 766-3482",,"visa, master card, check",,,,,,,,,,,,
15775,6599,"2020-09-27 02:31:05","Restaurant & Bar Recruitment Services",,,"(540) 998-9833","2430 Cheshire Bridge Rd NE",Atlanta,GA,30324,"2430 Cheshire Bridge Rd NE,Atlanta,GA 30324","Employment Consultants, Employment Contractors, Employment Screening, Human Resource Consultants, Talent Agencies",,,,33.82106,-84.35216,,"You're only as good as the people you hire.","Hiring for Restaurants and Bars is what we do.","Mon - Sun: Open 24 Hours",,,paypal,,,,,,,,,,,,
149805,53250,"2020-09-27 02:34:50","Karatbars Int'l",https://www.karatbars.com/landing/?s=kdavis0615,karatbarsgogetter@charter.net,"(618) 671-8176",,,,,,"Employment Consultants, Employment Contractors, Employment Opportunities, Gold, Silver & Platinum Buyers & Dealers",,,,,,,"Protection Through GOLD","Gold is not digital, cannot be wiped out by hackers, and is immune to crashing stock markets and bank failures. Russia has increased its gold reserves 70% in the past five years. China has increased its gold reserves over 200% in the same time period. Do they know something you don't?","Mon - Fri: 8:00 am - 9:00 pm Sat: 9:00 am - 12:00 pm",,,,,,"For More Information",,,,,,,,,
243641,80390,"2020-09-27 02:37:26","Jabord Inc.",http://www.jabord.com,al.dajka@worthy.com,"(212) 974-6488","551 5th Ave Rm 1425","New York",NY,10176,"551 5th Ave Rm 1425,New York,NY 10176","Diamond Buyers, Employment Consultants, Employment Contractors, Employment Opportunities, Internet Products & Services, Jewelers, Jewelry Buyers, Online & Mail Order Shopping, Personnel Consultants, Resume Service",,,,40.7516,-73.9761,,,,"Mon - Fri: 9:00 am - 6:00 pm",,,cash,,,"http://www.jabord.com http://www.worthy.com https://www.worthy.com",,,,,,,,,
624039,221431,"2020-09-27 02:51:42","My Own Personal Assistant In Tx",,myownpersonalassistantintx@gmail.com,"(972) 348-0044","8204 Elmbrook Dr",Dallas,TX,75247,"8204 Elmbrook Dr,Dallas,TX 75247","Employment Screening, Courier & Delivery Service, Employment Contractors, Internet Products & Services, Personal Services & Assistants",,,,32.82382,-96.86402,,"""REQUEST IT & WE'LL GET IT DONE. ""","""WE'RE HERE TO HELP."" WE OFFER A VARIETY OF SERVICES AND PRODUCTS.","Mon - Fri: 9:00 am - 9:00 pm Sat - Sun: 9:00 am - 7:00 pm",,,"all major credit cards, debit, cash",,,,,,,,,,,,
1070304,340045,"2020-09-27 03:03:45","UNIQUE STAFFING CONSULTANTS CORP",,,"(305) 417-1940","2842 SW 144th Pl",miami,FL,33175,"2842 SW 144th Pl,miami,FL 33175","Employment Consultants, Employment Agencies, Employment Contractors, Employment Screening, Notaries Public",,,,25.74083,-80.42961,,,,"Mon - Fri: 9:00 am - 9:00 pm",,,"paypal, cash, all major credit cards, travelers checks, debit, check",,,,,,,,,,,,
1102400,347899,"2020-09-27 03:04:22","BUSINESS SVCS OF BOONE NC",,,"(828) 265-1266","243 Jefferson Rd",Boone,NC,28607,"243 Jefferson Rd,Boone,NC 28607","Employment Agencies, Conference Centers, Employment Consultants, Employment Contractors, Employment Opportunities, Fax Service, Notaries Public, Resume Service, Secretarial Services, Temporary Employment Agencies, Trade Shows, Expositions & Fairs, Typing Service",5,"1 Review",,36.22096,-81.65983,,,"Receptionists*Data Enrty*Executive Assistants*Bookkeeping",,,,,,,,,"Joyce W.",03/28/2015,five,"I worked for On The Clock on and off for a liittle under 2 years. The experience",,,,
1121831,352672,"2020-09-27 03:04:59","Access Business and Training Services",http://www.access2yoursuccess.com,,"(757) 350-4502","P O Box 8302","Virginia Beach",VA,23450,"P O Box 8302,Virginia Beach,VA 23450","Employment Training, Business & Vocational Schools, Business Coaches & Consultants, Employment Contractors, Notaries Public, Secretarial Services",,,,36.776817,-75.98782,,,"Access Business and Training Services is a business support and training services company dedicated to servicing the needs of business owners and the working professionals they are looking to hire. We will provide you with thoroughly vetted candidates ready and available for your business. Business Support Services include Business start up assistance, Basic Bookkeeping, admin support and more... Training and career development is available for working professionals looking for a new career. Become certified by the nations largest credentialing organization in healthcare - the AAPC. Certified Medical Billing and/or Coding training is available Online. 24 Hour Mobile Notary Services are available for the Hampton Roads and surrounding areas. We provide all types of business and personal notary services. Electronic (E-Notary) Services are available Nationwide. Emergency and after hour notary services are available for an additional fee. Call today to schedule an appointment or for more information. 757-350-4502 x4","Hours Appointment Only Hours Mon - Sun Open 24 Mon - Fri: 9:00 am - 5:00 pm",,,"amex, debit",,,http://www.access2yoursuccess.com,,,,,,,,,
1129572,354546,"2020-09-27 03:05:15","JCBS, LLC",,,"(469) 525-5562","8150 N Central Expy Ste 930",Dallas,TX,75206,"8150 N Central Expy Ste 930,Dallas,TX 75206","Inventory Service, Accounting Services, Employment Contractors, Notaries Public, Secretarial Services",,,,32.8618,-96.76905,,,,,,,,,,,,,,,,,,,
2685171,833255,"2020-09-27 03:52:47","Wal-Staf Personnel Services",http://wal-staf.com,bob@wal-staf.com,"(352) 448-3543","4140 NW 27th Ln",Gainesville,FL,32606,"4140 NW 27th Ln,Gainesville,FL 32606","Executive Search Consultants, Computer Software & Services, Data Processing Service, Employment Agencies, Employment Consultants, Employment Contractors, Employment Opportunities, General Contractors, Temporary Employment Agencies",,,,29.67815,-82.38779,https://i2.ypcdn.com/blob/dce25f4c354487afff6d4e87d6840132c3962c09_100x100_crop.jpg?f9d23e1,,"Powered by experience since 1977. Simply put we find people our competitor's can't. Get your Medical Dream Job here! Dental assistance & Dental Hygienist Needed Now. Customer Service Person Needed now! Start making money now for light industrial work. Production workers needed now. Let Wal-Staf Help you bring home the money.","Mon - Fri: 8:00 am - 5:00 pm",,,"paypal, amex, master card, visa",,,"http://wal-staf.com http://aol.com",,,,,,,,,
2781721,857880,"2020-09-27 03:54:53","Pacific Remodel",,Pacific.contractor425@gmail.com,"(425) 931-5216",,Mesa,AZ,85202,"Mesa,AZ 85202","Contractor Referral Services, Altering & Remodeling Contractors, Bathroom Remodeling, Chimney Contractors, Closets Designing & Remodeling, Contractors Equipment & Supplies, Demolition Contractors, Driveway Contractors, Drywall Contractors, Drywall Contractors Equipment & Supplies, Employment Contractors, Grading Contractors, Kitchen Planning & Remodeling Service, Lighting Contractors, Paint Removing, Painting Contractors, Piping Contractors, Plastering Contractors, Stucco & Exterior Coating Contractors",,,,,,,,,"Mon - Sun: Open 24 Hours",,,,,,,,,,,,,,,
3198657,1018351,"2020-09-27 04:09:20","Jp Farm Labor Contracting",http://www.jpfarmlabor.com,jpfarm.contracting@gmail.com,"(503) 991-4549","3406 30th Ave NE",Salem,OR,97301,"3406 30th Ave NE,Salem,OR 97301","Farms, Employment Agencies, Employment Contractors, Temporary Employment Agencies",,,,44.96904,-122.99673,,,"We provides labor services in Oregon, California & Washington for the agricultural industry, We ensure that we follow all state and federal laws. Our number one goal is that our clients are completely satisfied with our services.","Mon - Sun: 7:00 am - 6:00 pm",,,"paypal, check, cash",,,"Please check out our website",,,,,,,,,
4115964,1309889,"2020-09-27 04:37:11","Ahead Human Resources",http://www.aheadhr.com,kporter@aheadhr.com,"(502) 485-1000","2209 Heather Ln",Louisville,KY,40218,"2209 Heather Ln,Louisville,KY 40218","Employment Agencies, Employment Consultants, Employment Contractors, Employment Opportunities, Handyman Services",1,"1 Review",A+,38.20638,-85.66591,,"""We're the people...people""","At Ahead Human Resources, our goal is simple: 100% client and employee satisfaction. We are dedicated to helping you reach your goals with an unsurpassed commitment to excellence. Our company is based on that premise, and thatВ’s what sets us apart from the rest. Ahead Human Resources, Inc. is a market leading Staffing and Professional Employer Organization (PEO). We deliver professional, personalized Human Resource solutions, Human Resource outsourcing, Payroll processing and Staffing services. Co-founded by entrepreneur William (Bill) Bellis and his wife Andrea in 1995, AheadВ’s mission is to В“find good jobs for good peopleВ” with our Staffing services, and to level the playing field for the small to medium sized business owner with our Human Resource services. Human Resource Services: В• Payroll Admin В• Benefit Admin (Health, Dental, 401K, etc.) В• Workers' Comp В• State Unemployment В• Employee Manuals Staffing Services (Light Industrial, Office and Clerical): В• Temp-to-Hire В• Temporary Permanent Placement В• On-Site Services В• Employee Orientation В• Professional Recruiting","Mon - Fri: 8:00 am - 5:00 pm",,,"master card",,"Ahead, Inc. Ahead HR Ahead Staffing ASI",http://www.aheadhr.com,,"Laye O.",10/04/2016,one,"this agency have a long history of discrimination of people immigrant , profiling people regarding origins it's the worst staffing in Louisville zero",,,,
4186246,1326556,"2020-09-27 04:38:48","Louisiana Skilled Labor",http://www.louisianaskilledlabor.com,,"(888) 944-8999","2043 Magazine St Ste E","New Orleans",LA,70130,"2043 Magazine St Ste E,New Orleans,LA 70130","Labor Organizations, Building Contractors, Carpenters, Employment Agencies, Employment Consultants, Employment Contractors, Employment Opportunities, General Contractors, Plate & Window Glass Repair & Replacement, Windows",5,"2 Reviews",,29.93063,-90.07566,,,"We offer workers to fulfill your company's needs and demands. Our workers are considered to be temporary employees by Louisiana Skilled Labors, LLC guidelines.The temporary employees can be changed in a matter of hours not days. We will provide you with the same skilled laborers each daym so valuable time, money & effort are not wasted on training. Employee turnover and less that adequate productivity will no longer be an issue for your company while working alongside Louisians Skilled Labor, LLC","Mon - Fri: 8:00 am - 6:00 pm Sat - Sun Closed",,,,,,http://www.louisianaskilledlabor.com,,rbuchanan,04/29/2013,five,"Good service. Quality workers. Needed several form carps and finishers...delivered with good service and quality workers. I'd use them again.",tdillinger,04/29/2013,five,"Not a bad service at all. Spoke to a very nice lady who handled my account professionally. Provided us with the labor we needed same day...good motivated workers as well. Hard to find a good service for this type of work/"
4223642,1335194,"2020-09-27 04:39:24","The Premier Group Staffing LLC",http://www.thepremiergroupus.com,marketing@thepremiergroupus.com,"(303) 997-5085","3295 Blake St Apt 104",Denver,CO,80205,"3295 Blake St Apt 104,Denver,CO 80205","Financing Consultants, Accountants-Certified Public, Accounting Services, Air Conditioning Contractors & Systems, Carpenters, Electricians, Employment Agencies, Employment Contractors, Employment Opportunities, Financial Planning Consultants, Mechanical Contractors, Plumbing Contractors-Commercial & Industrial, Temporary Employment Agencies",,,,39.76587,-104.97978,,,,"Mon - Fri: 8:00 am - 5:00 pm","Fax: (800) 401-6629",,,,,http://www.thepremiergroupus.com,,,,,,,,,
4347694,1359726,"2020-09-27 04:41:47","My Home Career",,greatworkathomecareer@yahoo.com,"(662) 251-9299",,,,,,"Employment Consultants, Dentists, Employment Contractors, Employment Opportunities, Opticians",,,,,,,"DENTAL, VISION, PRESCRIPTION, CHIROPRACTIC, AND HEALTH CARE DISCOUNTS!","Work At Home CareerВ® -Daily Pay! -Residual Income! -BBB Accredited! -Free Accidental Death Insurance and Benefits! -Make your own hours!","Mon - Fri: 8:00 am - 8:00 pm Sat - Sun: 11:00 am - 8:00 pm",,,"visa, master card, amex, discover, check",,,,,,,,,,,,
4667320,1440786,"2020-09-27 04:49:47","Avon - Mary Cirillo-Jones",http://www.youravon.com/mcirillojones,MACirilloJones@gmail.com,"(914) 450-7474","Po Box 618","Mohegan Lake",NY,10547,"Po Box 618,Mohegan Lake,NY 10547","Employment Consultants, Beauty Salons, Beauty Supplies & Equipment, Employment Contractors, Employment Opportunities",,,,41.314346,-73.85084,,,,,,,"check, all major credit cards, debit",,,http://www.youravon.com/mcirillojones,,,,,,,,,
5280861,1566943,"2020-09-27 05:01:26","Morningtown Builders Group",,,"(240) 426-4782","15713 Ambiance Dr","North Potomac",MD,20878,"15713 Ambiance Dr,North Potomac,MD 20878","Architects & Builders Services, Altering & Remodeling Contractors, Construction Management, Contractor Referral Services, Employment Contractors",,,,39.11278,-77.24228,,,,,,,,,,,,,,,,,,,
5448418,1629402,"2020-09-27 05:07:44","Access Point",http://www.accesspointhr.com,dzandstra@accesspointhr.com,"(248) 319-8000","42400 Grand River Ave",Novi,MI,48375,"42400 Grand River Ave,Novi,MI 48375","Telephone Companies, Employee Benefit Consulting Services, Employment Agencies, Employment Consultants, Employment Contractors, Employment Opportunities, Financial Services, Human Resource Consultants, Payroll Service, Professional Employer Organizations, Wireless Communication",,,,42.4792,-83.46536,,,,,,,,,,http://www.accesspointhr.com,,,,,,,,,
5615292,1678787,"2020-09-27 05:13:56",NOVENTION,http://www.novention.com,info@novention.com,"(949) 648-7448","3711 N. Harbor Blvd.",Fullerton,CA,92835,"3711 N. Harbor Blvd.,Fullerton,CA 92835","Internet Marketing & Advertising, Business Coaches & Consultants, Employment Contractors, Management Training, Web Site Design & Services",5,"1 Review",,33.91336,-117.93257,,"New Solutions","Novention - Web-Tech, Design, Marketing and Consulting","Mon - Fri: 9:00 am - 6:00 pm Sat: 10:00 am - 4:00 pm Sun Closed",,,"debit, paypal, all major credit cards",,,"Official Novention Website",,"Olga K.",01/18/2018,five,"I would recommend Novention to any business that is looking to create a professional online presence and gain new customers. Novention provides very high quality services that are personalized to the individual needs of each client. This company delivers real results!",,,,
5652115,1691073,"2020-09-27 05:15:12","May We Help You?",,L.mcdougal@live.com,"(855) 694-9552",,Chester,VA,23831,"Chester,VA 23831","Consultants Referral Service, Employment Contractors, Meeting & Event Planning Services, Web Site Design & Services",,,,,,,,,"Mon - Fri: 9:00 am - 5:00 pm Sat: 12:00 am - 3:00 pm Sun Closed",,,"all major credit cards",,,,,,,,,,,,
5674596,1698519,"2020-09-27 05:15:40",NOVENTION,http://www.novention.com,info@novention.com,"(714) 758-5467","407 W Imperial Hwy,#316",Brea,CA,92821,"407 W Imperial Hwy,#316,Brea,CA 92821","Internet Marketing & Advertising, Business Coaches & Consultants, Employment Contractors, Management Training, Web Site Design & Services",,,,33.91852,-117.90366,,"New Solutions","Novention - Web-Tech, Design, Marketing and Consulting","Mon - Fri: 9:00 am - 6:00 pm Sat: 10:00 am - 4:00 pm Sun Closed",,,"debit, paypal, all major credit cards",,,"Official Novention Website",,,,,,,,,
13634541,1791325,"2020-09-27 05:25:05","My Online Business Empire",,daeshell.burton@gmail.com,"(504) 553-6766","501 Stewart St",Lafayette,LA,70501,"501 Stewart St,Lafayette,LA 70501","Business Plans Development, Adult Education, Business & Personal Coaches, Business & Trade Organizations, Business & Vocational Management Schools, Business & Vocational Schools, Career & Vocational Counseling, Computer Online Services, Employment Consultants, Employment Contractors, Employment Opportunities, Internet Products & Services",,,,30.21897,-92.01186,https://i2.ypcdn.com/blob/66e4212ce2943879305e1d52228cdf91fd7f2f0f_100x100_crop.jpg?f9d23e1,""" HELPING YOU SUCCEED """,,"Mon - Sun: Open 24 Hours",,,"all major credit cards, financing available",,,,,,,,,,,,
15013954,1907704,"2020-09-27 05:36:05","Express Personnel Services",,,"(201) 288-7100",,,,,,"Adult Day Care Centers, Employment Agencies, Employment Contractors, Employment Opportunities, Home Health Services, Hospices, Labor Organizations, Roofing Contractors-Commercial & Industrial, Senior Citizens Services & Organizations",,,,,,,,"EMPLOYMENT AGENCY HELP SUPPLY SERVICES","Monday - Saturday 8am-9pm ET Automated system available 24 hours, 7 days a week",,,,,,,,,,,,,,,
15199528,1928055,"2020-09-27 05:37:41",ArcPak,http://www.arcalameda.org,judayvierra@arcalameda.org,"(510) 394-9881","14700 Doolittle Dr","San Leandro",CA,94577,"14700 Doolittle Dr,San Leandro,CA 94577","Employment Training, Adult Day Care Centers, Assisted Living & Elder Care Services, Business Coaches & Consultants, Business Management, Career & Vocational Counseling, Charities, Commercial Artists, Consulting Engineers, Developmentally Disabled & Special Needs Services & Products, Disability Services, Employee Benefit Consulting Services, Employment Consultants, Employment Contractors, Employment Opportunities, Industrial Engineers, Package Design & Development, Packaging Service, Professional Engineers",,,,37.692,-122.17287,,,"ArcPak is a warehousing and material handling service provider that operates several production facilities in the East Bay. The firm has more than 100,000 square feet of production and warehouse space. It has a staff of over 300 workers that provides assembly, bagging, blister packing, club store packaging, collating, fin sealing and labeling services. ArcPak offers kit assembly, heat sealing, shrink-wrapping and sorting services. The firm also provides pickup and delivery services. ArcPak is a part of The Arc of Alameda County, which is a nonprofit organization that has been serving customers since 1950. The Arc of Alameda County offers support, training and job placement assistance services for individuals with developmental disabilities.","Mon - Fri: 8:00 am - 4:00 pm Sat - Sun Closed",,,,,,"http://www.arcalameda.org http://arcpak.com",,,,,,,,,
15764740,1949792,"2020-09-27 05:40:05","Goodwill Workforce Connection Center",http://www.goodwillsew.com,,"(414) 353-6400","6055 N 91st St",Milwaukee,WI,53225,"6055 N 91st St,Milwaukee,WI 53225","Assisted Living & Elder Care Services, Adult Day Care Centers, Adult Education, Disability Services, Document Destruction Service, Employment Agencies, Employment Consultants, Employment Contractors, Employment Opportunities, Employment Services-Non Profit, Human Services Organizations, Packaging Service, Packing & Crating Service, Records Management Consulting & Service, Rehabilitation Services, Resale Shops, Senior Citizens Services & Organizations, Shredding-Paper, Social Service Organizations","4,5","3 Reviews",,43.12751,-88.02735,https://i2.ypcdn.com/blob/5079aa171dbc0d0f9a3e2958866fe39f0b6cb31e_100x100_crop.jpg?8ad0f92,"You can make a difference!","Human Service Organization","Mon - Fri: 9:00 am - 9:00 pm Sat: 10:00 am - 9:00 pm Sun Closed",,,"discover, all major credit cards, mastercard, amex, visa",,"Goodwill Industries Of Southeastern Wis Inc",http://www.goodwillsew.com,"Price Range : Average Wheelchair Accessible: Yes Bike Parking: Yes Parking: Lot, Private","Heather R.",12/27/2014,four,"Fun to shop at. Sometimes overpriced, though.",strongbox,04/22/2013,four,
16233751,2100843,"2020-09-27 05:54:31","DAYSTAR PRO MOVERS",,,"(480) 677-5062","2417 E Campbell Ave Apt 5b",Phoenix,AZ,85016,"2417 E Campbell Ave Apt 5b,Phoenix,AZ 85016","Movers & Full Service Storage, Employment Contractors, Movers",5,"3 Reviews",,33.50179,-112.02942,,"DEDICATED TO BRINGING PROFESSIONAL MOVING TO A NEW LEVEL","AFFORDABLE FREE ESTIMATES, AND ALWAYS PROFESSIONAL: AT DAYSTAR PRO MOVERS WE HAVE THE ABILITY TO STORE ITEMS IN OUR WAREHOUSE, DAYSTAR PRO MOVERS IS A 24/7 MOVING COMPANY, DAYSTAR PRO MOVERS IS YOUR VALLEY & STATEWIDE MOVERS","Mon - Sun: Open 24 Hours",": (602) 358-7026",,"check, no credit cards",,,,,daystarpromover,01/25/2013,five,"THIS MOVING COMPANY IS THE BEST !!! The Guy's at Daystar Pro Movers are Really And Truly Dedicated Professional Movers ...",luckeeegirl,02/10/2011,five,"Daystar Pro Movers moved us just before the 1st of the year. Their service was on the spot. They were on time and took very good care of all are stuff, like it was their own. They got us moved in a timely manner. Everything got to our new place in the same shape as it was when it left our old house. I would recommend them to anyone. Thank You Daystar Pro Movers...!!!!"
16284546,2118639,"2020-09-27 05:56:32","Apdc Services Inc",,,"(407) 483-5947","3059 Michigan Ave",Kissimmee,FL,34744,"3059 Michigan Ave,Kissimmee,FL 34744","Dry Cleaners & Laundries, Commercial Laundries, Employment Contractors",,,,28.33909,-81.3887,,"We work for you!","Our culture is to deliver quality service to our clients & partners with professionalism and integrity. The driving force of our success is in meeting the needs and goals of the client first. The commitment behind APDC is that when our clients are successful and satisfied APDC will prosper, we are in the partnership business and building long term relations. As your organization experiences changes financially or quality driven APDC prides itself in being incredibly resourceful to adapt to the every changing economic trends. We are your constant pillar of reliability while delivering quality service and resources for all of your hospitality needs.","Mon - Fri: 9:00 am - 5:00 pm","TollFree: (844) 266-8465",,"discover, visa, mastercard, all major credit cards, check, debit",,,,"Parking: Free Wheelchair Accessible: Yes",,,,,,,,