business_x_category.id,business.id,business.ts,business.business_name,business.home_page,business.email_address,business.phone,business.street,business.city,business.state,business.zip_code,business.full_address,business.category,business.rating,business.number_of_reviews,business.bbb_rating_or_license,business.latitude,business.longitude,business.cover_image,business.slogan,business.general_info,business.regular_hours,business.extra_phones,business.services_products,business.payment,business.price_range,business.aka,business.other_links,business.other_information,business.review_1_name,business.review_1_date,business.review_1_rating,business.review_1_text,business.review_2_name,business.review_2_date,business.review_2_rating,business.review_2_text
97967,42129,"2020-09-27 02:33:52","Ford Community & Performing Arts Center",http://dearbornfordcenter.com,dearbornrec@gmail.com,"(313) 943-2350","15801 Michigan Ave",Dearborn,MI,48126,"15801 Michigan Ave,Dearborn,MI 48126","Community Centers, Art Galleries, Dealers & Consultants, Art Instruction & Schools, Art Restoration & Conservation, Arts Organizations & Information, Athletic Organizations, Ballrooms, Bands & Orchestras, Banquet Halls & Reception Facilities, Baseball Clubs & Parks, Basketball Clubs, Bingo Halls, Cafeterias, Camps-Recreational, Card Playing Rooms, Caterers Menus, Charities, Cheerleading, Child Care, Children's Instructional Play Programs, Children's Party Planning & Entertainment, City, Village & Township Government, Climbing Instruction, Clubs, Community Organizations, Concert Halls, Conference & Seminar Coordinators, Conference Centers, Craft Instruction, Dance Halls, Dancing Instruction, Day Care Centers & Nurseries, Drinking Fountains, Driving Service, Educational Materials, Educational Research, Event Ticket Sales, Exercise & Physical Fitness Programs, Family & Business Entertainers, Fine Art Artists, Government Offices, Gymnasiums, Gymnastics Instruction, Halls, Auditoriums & Ballrooms, Headquarters, Health & Fitness Program Consultants, Health Clubs, Hearing & Sound Level Testing, Human Services Organizations, Knitting Instruction, Medical Practice Consultants, Medical Service Organizations, Meeting & Event Planning Services, Music Instruction-Instrumental, Music Instruction-Vocal, Parks, Party & Event Planners, Personal Fitness Trainers, Physical Fitness Consultants & Trainers, Physical Therapists, Picnic Grounds, Playgrounds, Private Swimming Pools, Public Swimming Pools, Racquetball Courts, Reducing & Weight Control, Retreat Facilities, School Supplies & Services, Senior Citizens Services & Organizations, Sitting Services, Sports & Entertainment Centers, Sports Information Service, Stadiums, Arenas & Athletic Fields, Stages, Stress Management & Prevention, Swimming Instruction, Tennis Instruction, Theatrical & Stage Lighting Equipment, Theatrical & Stage Lighting Equipment-Services, Theatrical Agencies, Theatrical Managers & Producers, Tourist Information & Attractions, Trade Shows, Expositions & Fairs, Transportation Providers, Vending Machines-Wholesale & Manufacturers, Water Parks & Slides, Yoga Instruction, Youth Camps, Youth Organizations & Centers","3,5","2 Reviews",,42.31521,-83.19822,https://i1.ypcdn.com/blob/fa556939cde06a6ca82dcdfeb150c1cea06fc2f0_100x100_crop.jpg?f832250,"Your New Place To Play","The Ford Community & Performing Arts Center is a multi-faceted, multi-facility network of leisure, fitness, life enrichment and cultural arts activities, offering something for everyone.","Mon - Fri: 5:30 am - 10:00 pm Sat: 8:00 am - 8:00 pm Sun: 9:00 am - 6:00 pm","Senior Services: (313) 943-2412 Theater Box Office: (313) 943-2354 Facility Rentals: (313) 943-2381",,,,"Recreation Center Civic Center Michael A. Guido Theater","Ford Community & Performing Arts Center Dearborn Recreation and Parks","Parking: Lot, Free Wheelchair Accessible: Yes Bike Parking: Yes","Nehal R.",07/19/2014,three,"2 have trade shows and Conventions",janash85,11/18/2007,four,"art is the joy of this life, i wanted to go out of the depress that i had, so i searched for this"
324701,107765,"2020-09-27 02:40:32","Universalbay LLC",,,"(866) 333-5677","2228 Oakland Rd","San Jose",CA,95131,"2228 Oakland Rd,San Jose,CA 95131","Cafeterias, Office Equipment & Supplies, Paper Products, Printers-Equipment & Supplies",,,,37.39985,-121.90214,,,,,,,,,,,,,,,,,,,
503962,171176,"2020-09-27 02:47:08","Convene-730 Third Avenue",http://www.convene.com,info@convene.com,"(888) 730-7307","730 3rd Ave","New York",NY,10017,"730 3rd Ave,New York,NY 10017","Trade Shows, Expositions & Fairs, Audio-Visual Production Services, Cafeterias, Conference Centers, Food Service Management",,,,40.75318,-73.97332,,"Where People & Productivity Meet","Convene, 730 Third Avenue is the preferred venue option for the sophisticated & distinguished professional that demands a focused and tranquil environment. Originally opened in the Fall 2009 as Manhattan largest dedicated meeting and event venue,Convene, 730 Third Avenue is specifically designed to provide a distraction-free setting for all occasions ranging from conferences, trade shows and executive training programs to cocktail receptions, seated dinners and holiday parties and so much more, the possibilities are endless. Located two blocks from Manhattan's Grand Central Station (serving AmTrak and metroNorth railroads), Convene, 730 Third Avenue offers a centrally located sanctuary in the midst of midtown hustle and bustle. Every inch of Sentry Centers' 25,000 square foot event and meeting space exudes an exclusive and sophisticated elegance. 4,000 square ft Wharton Ballroom, located on the 17th floor, features 22 ft high windows offering breathtaking views of the Manhattan skyline while numerous other rooms on the 17th, 18th and 27th floors comfortably accommodate 2 to 100 guests. For warmer months, the 5,000 square foot outdoor terrace can serve as a terrific backdrop for an open air-lounge or an evening banquet. Our elegantly appointed 27th floor Executive Level, is home to an exquisite 40 seat board room. Various other spaces on the floor can be broken up into separate intimate dining and breakout areas, all with spectacular skyline views and unparalleled services and amenities. In the kitchen, chefs have crafted signature, world class menus ready to be personalized beyond perfection. Of course, a space is only as good as its service and team of consummate professionals will be with you every step along the way to ensure a seamless experience for you and your guests from planning to the final execution of your event.","Mon - Fri: 7:30 am - 6:00 pm Sat - Sun: Open 24 Hours",,,,,,,,,,,,,,,
744581,255994,"2020-09-27 02:55:30","Personnel Plus, Inc.",https://personnelplusinc.com,jsauceda@personnel.com,"(208) 466-6800","1116 Caldwell Blvd",Nampa,ID,83651,"1116 Caldwell Blvd,Nampa,ID 83651","Temporary Employment Agencies, Air Conditioning Equipment & Systems-Wholesale & Manufacturers, Aquaculture, Beans, Building Construction Consultants, Cafeterias, Caterers, Commercial & Industrial Door Sales & Repair, Construction Management, Data Processing Service, Employment Agencies, Fish Farms, Fish Hatcheries, Food Delivery Service, Hay, Home Cooking Restaurants, Parking Stations & Garages-Construction, Pizza, Ranches, Restaurant Cleaning, Restaurant Management & Consultants, Restaurant Referral Service, Sandblasting Equipment & Supplies",,,,43.60001,-116.59488,,"Your Total Staffing Solution!",,"Mon - Fri: 8:00 am - 5:00 pm",,,discover,,,https://personnelplusinc.com,"Parking: Lot, Free Wheelchair Accessible: Yes",,,,,,,,
904993,300962,"2020-09-27 03:00:02","Ismoothies Cafe",,,"(407) 944-0788","1750 Ball Park Rd",Kissimmee,FL,34741,"1750 Ball Park Rd,Kissimmee,FL 34741","Nutritionists, Cafeterias, Coffee Shops, Vitamins & Food Supplements",5,"1 Review",,28.33653,-81.42161,https://i1.ypcdn.com/blob/3e03eb36193ac1b87ec775b29b90d8ef25055eef_100x100_crop.jpg?8ad0f92,,,"Mon - Thu: 8:30 am - 11:00 pm Fri: 8:30 am - 10:00 pm Sat - Sun: 9:00 am - 8:00 pm",,,,,,,"Wheelchair Accessible: Yes","Jason M.",09/24/2015,five,"The iSmoothies are the reason why I go to that gym. I'm addicted to them, so tasty and such a low calories while high on protein. Ask the person working there to recommend you a specific one based on your fitness goal. That combined with good training is what I follow. Lost 40 lbs in 3 months and kept it off, I Will NEVER give up.",,,,
1458717,463143,"2020-09-27 03:15:44","Back Alley Vapes",,,"(405) 604-2950","5026 N May Ave","Oklahoma City",OK,73112,"5026 N May Ave,Oklahoma City,OK 73112","Vape Shops & Electronic Cigarettes, Cafeterias, Cigar, Cigarette & Tobacco Dealers, Pipes & Smokers Articles","4,5","3 Reviews",,35.521515,-97.5657,https://i1.ypcdn.com/blob/af79da2fee3317ce10a39c5be6aa5ec550cb200f_100x100_crop.jpg?f9d23e1,,,"Mon - Fri: 11:00 am - 7:00 pm Sat - Sun: 11:00 am - 5:00 pm",,,"mastercard, discover, amex, visa",,,,,"Kay E.",09/29/2014,five,"Great place. Is so very unique compared to any other cape shop. The owners are so nice. They even have concerts sometimes right there in the shop! Very fun place to go to get all your vape supplies.","D richard W.",07/11/2014,three,"nice shop very little equipment and very few juices neat old collectables very nice people"
2117347,652988,"2020-09-27 03:34:45","Jonnet Flea Market",https://maps.google.com/?cid=3913195921293584276,,"(724) 459-0143","9912 Route 22",Blairsville,PA,15717,"9912 Route 22,Blairsville,PA 15717","American Restaurants, Antiques, Cafeterias, Flea Markets",,,,40.43422,-79.28206,,,,"Mon - Fri Closed Sat - Sun: 9:00 am - 4:00 pm",,,"cash only",,,https://maps.google.com/?cid=3913195921293584276,"Parking: Free Wheelchair Accessible: Yes",,,,,,,,
2132243,659693,"2020-09-27 03:35:34","Antiques N More",http://www.antiquesnmore.com,,"(918) 352-3232","102 N Ohio Ave",Drumright,OK,74030,"102 N Ohio Ave,Drumright,OK 74030","Antiques, Cafeterias",,,,35.98863,-96.59943,,,,"Mon - Fri: 8:30 am - 2:00 pm Sat - Sun Closed",,,"discover, mastercard, all major credit cards, visa, amex",,"Antiques, Deli, Motel N More",http://www.antiquesnmore.com,"Parking: Street, Free Wheelchair Accessible: Yes",,,,,,,,
2520229,775508,"2020-09-27 03:46:23","Sandstar Custom Cabinets",http://www.sandstarcustomcabinets.com,,"(918) 456-3113","22735 S 574 Rd",Welling,OK,74471,"22735 S 574 Rd,Welling,OK 74471","Kitchen Planning & Remodeling Service, Altering & Remodeling Contractors, Bathroom Remodeling, Building Contractors, Cabinet Makers, Cabinets, Cabinets-Refinishing, Refacing & Resurfacing, Cafeterias, Carpenters, Counter Tops, General Contractors, Home Improvements, Home Repair & Maintenance, Restaurants, Woodworking",,,A+,35.84813,-94.87674,https://i1.ypcdn.com/blob/e258c7508deb04d22edf08ee4694ac44f360a335_100x100_crop.jpg?8ad0f92,"Quality - Experience - Integrity - The Sandstar Difference","We custom design and build for any room! Kitchens, Bathrooms, Bookcases, China Cabinets, Entertainment Centers, Computer Desks, Gun Cases, Fireplace Mantles, and more! We strive for customer satisfaction.","Mon - Fri: 8:00 am - 5:00 pm Sat - Sun Closed Holiday Hours 2020/01/01 Closed Holiday Hours 2020/12/25 Closed","cell phone: (918) 931-8483 toll free: (888) 456-3113",,"check, cash, no credit cards",,,http://www.sandstarcustomcabinets.com,"Services: Kitchens ~ Bathrooms ~ Bookcases ~ China Cabinets~ Entertainment Centers ~ Computer Desks ~ Gun Cases ~ Fireplace Mantles ~ Countertops ~ and more!",,,,,,,,
3174126,1004523,"2020-09-27 04:08:13","Roca Berry Farm",http://www.rocaberryfarm.com,,"(402) 421-2255","16531 S 38th St",Roca,NE,68430,"16531 S 38th St,Roca,NE 68430","Fruit & Vegetable Markets, Cafeterias, Farms",,,A+,40.649,-96.66724,,,,"Thu 9am-5pm","Phone: (402) 421-2933",,"all major credit cards",,"Roca Berry Farm Inc.","http://www.rocaberryfarm.com https://rocaberryfarm.com","Parking: Lot",,,,,,,,
3220781,1030817,"2020-09-27 04:10:22","Hillbilly Farms",http://www.hillbilly-farms.com,HillbillyFarms.FL@gmail.com,"(352) 206-7478","10325 Us Highway 98","Dade City",FL,33525,"10325 Us Highway 98,Dade City,FL 33525","Farms, Bakeries, Cafeterias",,,,28.30849,-82.16405,,,,"Mon - Fri: 8:00 am - 5:30 pm Sat: 10:00 am - 5:00 pm Sun Closed","Phone: (352) 567-7475",,"master card, visa, cash, discover",,,http://www.hillbilly-farms.com,,,,,,,,,
3251129,1048040,"2020-09-27 04:12:26","Apple Hills Fruit Farm",http://www.applehills.com,j.j@applehills.com,"(607) 729-2683","131 Brooks Rd",Binghamton,NY,13905,"131 Brooks Rd,Binghamton,NY 13905","Farms, Cafeterias, Fruit & Vegetable Markets, Restaurants",5,"1 Review",,42.20779,-75.94861,,,,"Mon - Sat: 8:00 am - 3:00 pm Sun: 9:00 am - 2:00 pm","Phone: (607) 729-8183 Fax: (607) 729-8183 TollFree: (800) 850-2775",,"all major credit cards, mastercard, discover",,"Apple Hills Farm Apple Farms Apple Hills Cafe Apple Dumpling Cafe","http://www.applehills.com https://applehills.com http://applehills.com/cafe","Parking: Lot, Free Attire: Casual Wheelchair Accessible: Yes Bike Parking: Yes Takes Reservations: No Outdoor Seating: Yes",debsthoughts,06/21/2011,five,"Doesn't get much better than this. Only open for breakfast and lunch, this place has homemade everything, including the bread. Set in a barnlike atmosphere you can eat inside or watch the countryside while eating on their deck. Great service, down to earth homecooked meals and very reasonably priced. Since they also own acres of fruit trees, they incorporate the fruit of the season into their meals. And while you're there, you may want to pick your own strawberries, blueberries, rasberries, apples, etc. Congrats on your success, owners. Keep up the good work.",,,,
3289054,1069598,"2020-09-27 04:14:26",Pizzadili,http://www.pizzadilideli.com,pizzadili@verizon.net,"(302) 697-9555","2089 S Dupont Hwy",Dover,DE,19901,"2089 S Dupont Hwy,Dover,DE 19901","Wineries, Bakeries, Cafeterias, Caterers, Dessert Restaurants, Food & Beverage Consultants, Italian Restaurants, Liquor Stores, Restaurants, Wine","2,5","3 Reviews",,39.12118,-75.53306,https://i1.ypcdn.com/blob/77b9f89518a637221fbee3b69deb3594cc055ce7_100x100_crop.jpg?f9d23e1,"Personalized Service & Distinctive Party Trays","Pizzadili is a family-owned and operated Italian restaurant. We have been serving food to customers in Dover, DE, since 1955. We provide top-rated customer service along with a family-friendly atmosphere. We provide quality service at an affordable rate. Contact us today for more information!","Mon - Sat: 9:00 am - 9:00 pm",,,"all major credit cards",,,http://www.pizzadilideli.com,"Parking: Lot, Free Wheelchair Accessible: Yes Specialties: Bridal, Weddings, Open House, Corporate Meetings, Parties, Fiestas",delmarvachicken,01/12/2012,five,"They sure make a great sub !",KylePowderly,11/11/2011,one,"While Pizzadili may have good food, their lack of customer service and professionalism is appalling. We hired Pizzadili to do the catering for my parents' 50th wedding anniversary renewal of vows and luncheon. They nearly ruined a once-in-a-lifetime event. We hired them to set up at noon and break down at 3PM. They showed up nearly an hour late, missing a piece of equipment and without the champagne flutes for the toast at the beginning of the luncheon. They left our guests hanging for 20 minutes after the luncheon was supposed to start, and then forced us to rearrange the order of events to accommodate their mistake. To add insult to injury, the person they left there began pressuring us at 2:30 to begin clean-up, immediately after we'd FINALLY been able to do the toast. Glasses still half-full of sparkling cider were removed from guests so Pizzadili could clean up and they were gone by 2:50PM, leaving us to return the tablecloths and commercial coffee container. They never bothered to call us or the church where the luncheon was being held to inform us of any problem with being late. When my wife spoke with Pete Pizzadili (one of the owners) later in the week, he said he was sorry but made the excuse that they'd had another event at the same time. My wife had to pressure him to make some sort of amends for their gross negligence, and at that we only had $80 knocked off a $1,400 bill. The owner's reason for not reducing our bill as apology? He would """"end up taking a loss"""" on the job. We took an unrecoverable loss on this important family event. Anyone who is unable to recognize that they should take a financial loss because of their incompetence (or at least their inability to do the job they promised) should not be a company you do business with."
3645839,1180702,"2020-09-27 04:25:24","Jeff Rouse Swim Center",http://www.rousecenter.com,aconway@rousecenter.com,"(540) 318-6332","1600 Mine Rd",Stafford,VA,22554,"1600 Mine Rd,Stafford,VA 22554","Exercise & Fitness Equipment, Cafeterias, Gymnasiums, Personal Fitness Trainers, Private Swimming Pools, Swimming Instruction",,,,38.42796,-77.43302,,,"The Rouse Center (JRSSC) is a state-of-the-art 76,000 square foot facility that houses a 50-meter competition pool with movable bulkhead and seating for over 800 spectators, a 25-yard recreation pool, a warm-water wellness pool, a group exercise studio, fitness floor, a full-size basketball court, and a full-service cafe to serve guests.","Mon - Fri: 5:00 am - 10:00 pm Sat: 7:00 am - 7:00 pm Sun: 8:00 am - 6:00 pm",,,,,"Jeff Rouse Swim & Sport Center Jeff Rouse Swim and Sport Center Jeff Rouse Swim & Sport Ctr","http://www.rousecenter.com https://rousecenter.com","Parking: Lot, Self",,,,,,,,
4060044,1294893,"2020-09-27 04:35:41","Seniors First",http://seniorsfirst.org,info@auburnchamber.net,"(530) 889-9500","12183 Locksley Ln Ste 205",Auburn,CA,95602,"12183 Locksley Ln Ste 205,Auburn,CA 95602","Handyman Services, Cafeterias, Information Bureaus & Services, Senior Citizens Services & Organizations, Transportation Providers",,,,38.95158,-121.09664,https://i3.ypcdn.com/blob/b9c94a320c0528283585938ea90fe83a3432d737_100x100_crop.jpg?adceb05,,,"Mon - Fri: 7:30 am - 4:30 pm Sat - Sun Closed","TollFree: (800) 878-9222",,,,,http://seniorsfirst.org,,,,,,,,,
4456968,1382443,"2020-09-27 04:44:08","Santa Cruz Veterinary Hospital",http://www.santacruzveterinaryhospital.com,info@santacruzveterinaryhospital.com,"(831) 475-5400","2585 Soquel Dr","Santa Cruz",CA,95065,"2585 Soquel Dr,Santa Cruz,CA 95065","Veterinarians, Cafeterias, Restaurants, Veterinarian Emergency Services, Veterinary Clinics & Hospitals, Veterinary Specialty Services",,,,36.98844,-121.97365,,"Caring for pets and their people for more than 50 years.","SCVH is a unique veterinary practice located in Santa Cruz, California. In addition to wellness care for your pet, we provide specialty referral services made up of board certified veterinarians who treat and cure animals with complex and serious illness. Our practice is staffed 24 hours a day, which allows us to provide emergency service and overnight care when your family veterinarian is not available.","Mon - Sun: Open 24 Hours",,,"amex, discover, check, debit, insurance, cash, visa, mastercard",,,http://www.santacruzveterinaryhospital.com,"Parking: Street, Lot Wheelchair Accessible: Yes",,,,,,,,
5089464,1520471,"2020-09-27 04:57:48","Just Judy's",,justjudys@att.net,"(317) 254-8796","2210 E 54th St",Indianapolis,IN,46220,"2210 E 54th St,Indianapolis,IN 46220","Family Style Restaurants, Breakfast, Brunch & Lunch Restaurants, Cafeterias, Caterers, Restaurants, Steak Houses, Take Out Restaurants",,,,39.8518,-86.12432,,,,"Monday-Sunday Open at 6:30 AM","Fax Number: (317) 254-4569 Fax: (317) 254-4569",,,,"Just Judy's Family Restauland",,"Cuisines: Caterers, Family Style, Take Out, Cafeterias, Breakfast, Brunch & Lunch, Steakhouse",,,,,,,,
5091155,1520755,"2020-09-27 04:57:48","Cafe Tuotu",http://www.georgetowndcgourmet.com,,"(202) 337-4455","3421 M St NW",Washington,DC,20007,"3421 M St NW,Washington,DC 20007","Coffee Shops, Breakfast, Brunch & Lunch Restaurants, Cafeterias, Caterers, Delicatessens, Dessert Restaurants, Ice Cream & Frozen Desserts, Italian Restaurants, Restaurants, Sandwich Shops, Steak Houses",,,,38.90525,-77.06852,,,,"Mon - Sat: 10:00 am - 5:00 pm",,,"all major credit cards",,"Cafe Tu O Tu Express Cafe Tu O Tu Express (Now Georgetown Gourmet) Georgetown Gourmet (Formerly Cafe Tu O Tu Express) Georgetown Gourmet Tu-Tu Cute","http://www.georgetowndcgourmet.com http://www.cafetuotu.com http://2tucute.webs.com","Cuisines: Deli, Caterers, Sandwiches, Cafeterias, Breakfast, Brunch & Lunch, Italian, Dessert, Ice Cream, Steakhouse, European, Continental Wi-Fi: Free Wheelchair Accessible: Yes Alcohol: No Parking: Street Bike Parking: Yes Attire: Casual Takes Reservations: No Outdoor Seating: No Price Range : Below Average Pets Allowed: No",,,,,,,,
5108050,1523614,"2020-09-27 04:57:55","Cafe Portofino",http://www.cafeportofino.net,info@cafeportofino.net,"(828) 264-7772","970 Rivers St",Boone,NC,28607,"970 Rivers St,Boone,NC 28607","Cafeterias, Beer & Ale, Pasta, Restaurants, Steak Houses, Take Out Restaurants, Wine",5,"2 Reviews",A+,36.21808,-81.68566,https://i3.ypcdn.com/blob/ea4fa697fff816fa68290da1a034f60aeec6aac1_100x100_crop.jpg?f832250,,"Tap Room Hours: Sun & Tues-Sat: 11:30am - 2:00 am. Monday: Closed.","Mon Closed Tue - Thu: 11:30 am - 9:00 pm Fri - Sat: 11:30 am - 10:00 pm Sun: 11:30 am - 9:00 pm",,,"cash, all major credit cards, master card, visa",,,website,"Parking: Street, Lot, Private Wi-Fi: Free Bike Parking: Yes Attire: Casual Wheelchair Accessible: Yes Cuisines: Italian, European, Continental Alcohol: Full Bar Takes Reservations: No Outdoor Seating: Yes Price Range : Average",boonebones,04/15/2011,five,"This place is always my first choice for eating out in Boone...they have some steep prices on certain items, but they never fail to impress me with the food. Their fold-overs are excellent, great pasta, the leghorns have a great sauce, potato cakes are deep friend and no greasy! Great set of dart boards, pool tables, and ample room to mingle, great bar prices!",sushigirlfriend,06/29/2010,five,"I love love love this restaurant. When I lived in Boone it used to be called the Stinkin' Rose (for garlic blooms) and we even had our rehearsal dinner here. It is an underrated and underappreciated restaurant. The seafood dishes are fantastic and even their appetizers like french fries have that special something to them. Great presentation and friendly staff. Avoid the table made of slate? it's uneven and just not useful. It's pretty though. LOL"