business_x_category.id,business.id,business.ts,business.business_name,business.home_page,business.email_address,business.phone,business.street,business.city,business.state,business.zip_code,business.full_address,business.category,business.rating,business.number_of_reviews,business.bbb_rating_or_license,business.latitude,business.longitude,business.cover_image,business.slogan,business.general_info,business.regular_hours,business.extra_phones,business.services_products,business.payment,business.price_range,business.aka,business.other_links,business.other_information,business.review_1_name,business.review_1_date,business.review_1_rating,business.review_1_text,business.review_2_name,business.review_2_date,business.review_2_rating,business.review_2_text
35635,15730,"2020-09-27 02:31:32","Psychic Medium & Hypnosis Sanctuary Inn",http://www.ameliaislandadventures.com,,"(904) 404-6758","17524 Montessa Ter",Jacksonville,FL,32226,"17524 Montessa Ter,Jacksonville,FL 32226","Hypnotists, Bed & Breakfast & Inns, Psychics & Mediums",,,,30.56039,-81.59675,,,,"Mon - Fri: 9:00 am - 8:30 pm","9044046758: (904) 404-6758",,"all major credit cards",,,"Kayak/SUP tours, Inn, & spiritual guidance","Wi-Fi: Free",,,,,,,,
314392,104310,"2020-09-27 02:40:19","Long Branch Trolley",http://www.longbranchtrolley.com,tomyoung329@comcast.net,"(732) 850-5449","608 2nd Ave","Long Branch",NJ,07740,"608 2nd Ave,Long Branch,NJ 07740","Limousine Service, Bed & Breakfast & Inns, Buses-Charter & Rental, Resorts, Travel Services-Commercial",,,,40.28478,-73.98664,,"Wedding specialists, we seat 24 people, also available for pub tours, rehearsal dinners, private parties.",,,,,check,,,http://www.longbranchtrolley.com,,,,,,,,,
318225,105710,"2020-09-27 02:40:22","America's Best Inn & Suites",,abis508@yahoo.com,"(863) 682-0303","508 E Memorial Blvd",Lakeland,FL,33801,"508 E Memorial Blvd,Lakeland,FL 33801","Motels, Bed & Breakfast & Inns, Bus Lines, Car Rental, Corporate Lodging, Historical Places, Hotels-Apartment, Lodging, Restaurants, Stadiums, Arenas & Athletic Fields","2,5","2 Reviews",A+,28.05553,-81.95291,,,"Welcome to Americas Best Inn And Suites, your Lakeland В“home away from home.В” Americas Best Inn And Suites aims to make your visit as relaxing and enjoyable as possible, which is why so many guests continue to come back year after year. While staying at Holiday Palm Hotel, visitors can check out Lake Mirror Historic Tour (0.8 mi) and Joker Marchant Stadium (1.3 mi), some of Lakeland's top attractions. Holiday Palm Hotel offers guests an array of room amenities including air conditioning and a refrigerator, and getting online is possible, as free wifi is available. The motel offers a 24 hour front desk, to make your visit even more pleasant. The property also features a pool and an on-site restaurant. Guests arriving by vehicle have access to free parking. If you like Mexican restaurants, Americas Best Inn And Suites is conveniently located near Tapatio's Restaurant Mexicano, Mega Mercado, and La Michoacana Mexican Restaurant. Should time allow, Hollis Garden, Lake Mirror, and Munn Park are some popular attractions that are within walking distance. Americas Best Inn And Suites puts the best of Lakeland at your fingertips, making your stay both relaxing and enjoyable.","Mon - Sun: Open 24 Hours","Phone: (863) 683-0800 Fax: (863) 683-0800",,"visa, discover, mastercard, all major credit cards",,,,"Parking: Lot Wheelchair Accessible: Yes","Sam P.",03/25/2016,four,"At America's Best Inn & Suites, we are committed to providing fair quality lodging and excellent customer service to Lakeland, Fl and its surrounding area","Keith S.",03/19/2016,one,"The one star is a stretch. Started off by getting an estimate for a one week stay. That was honored at check in but 3 days later was told the price was wrong and had to come up with an additional $59 in the next 30 minutes or we would be removed from our room and refunded a fraction if what we paid. Then there's the ongoing rate increases by the hour. Checkout/checking time is 11am if you call to let them know you want to stay another night you are quoted a price, great let's stay another night right? In the time it takes to walk to the front desk that price has jumped about 20$ higher. When you inquire about the quote the manager Sam gets nasty almost combatative and asks you to pay it or leave. This is the same owner that has been seen smoking drugs in the rooms of some of his employees. Yet is quick to deny a person because "" they look like a certain type of person. The rooms are borderline slum worthy and while unpacking I went to hide a few valuables under my bed only to finf"
368104,122066,"2020-09-27 02:42:16","Woods Hole Hostel & Mountain Retreat",http://www.woodsholehostel.com,woodsholehostel@gmail.com,"(540) 921-3444","3696 Sugar Run Rd",Pearisburg,VA,24134,"3696 Sugar Run Rd,Pearisburg,VA 24134","Hostels, Bed & Breakfast & Inns, Lodging, Massage Therapists, Yoga Instruction",5,"1 Review",A+,37.2509,-80.84967,https://i1.ypcdn.com/blob/652e189758e5be24f2748c126aa6faa9f45ac856_100x100_crop.jpg?f832250,"""A slice of heaven not to be missed""","Woods Hole opened to Appalachian Trail hikers in 1986. The chestnut log cabin was built in 1880 by Stoney Holiday. When Tillie & Roy Wood discovered the dilapitated cabin in 1940 they lived in the home for one year later to purchase the cabin and hold onto it for their retirement days. In 2007 Tillie passed away. Her granddaughter Neville & husband Michael have continued and expanded Roy & Tillies dream. Two indoor guest rooms, massage therapy, organic gardening, and bee keeping are only a few of the expansions. Appalachian trail hikers continue to enjoy the hostel alongside guests that are looking for a unique retreat and community.","Mon - Fri: 9:00 am - 5:00 pm",,,"all major credit cards, check, debit, travelers checks",,,http://www.woodsholehostel.com,"Wi-Fi: No By Appointment Only: No",woodshole,03/06/2012,five,"Woods Hole is one of those magical places. It's like discovering a secret deep in the woods. Between Organic gardening, bee keeping, yoga in the afternoon, and a variety of chores at hand, Wood's Hole provides an experience unlike most. Woods Hole is more than a bed and breakfast or a hostel it's a home.. and Neville & Michael ensure you feel like one of the family.",,,,
374911,124931,"2020-09-27 02:42:20","Treehouse Point",http://www.treehousepoint.com,info@treehousepoint.com,"(425) 441-8087","6922 Preston Fall City Rd SE",Issaquah,WA,98027,"6922 Preston Fall City Rd SE,Issaquah,WA 98027","Lodging, Bed & Breakfast & Inns, Massage Services, Motels, Yoga Instruction",,,,47.53835,-121.91038,https://i1.ypcdn.com/blob/0e7d59037310f875885f0cd1b095daa1f7130ee9_100x100_crop.jpg?f832250,,"A unique bed and breakfast in tree houses located intimately within natures woods. Also a great place for weddings and retreats with nearby hiking trails farmer's markets and more.","Mon - Fri: 9:00 am - 12:00 pm","Phone: (425) 441-4016 Primary Phone: (425) 441-4016 TollFree: (800) 272-5474",,"debit, all major credit cards",,"Treehouse Point Pond Room",http://www.treehousepoint.com,"Wi-Fi: Free",,,,,,,,
397088,134198,"2020-09-27 02:43:24",Maynard's,,,"(504) 913-5121","14520 Perdido Key Dr",Pensacola,FL,32507,"14520 Perdido Key Dr,Pensacola,FL 32507","Hotels, Bed & Breakfast & Inns, Condominiums, Hotels-Apartment, Retreat Facilities",5,"1 Review",,30.29514,-87.44605,,,,,,,,,,,,ypbf00,06/03/2013,five,"What a great place to stay! If you are looking for accomodations that has the best location, beautiful views & friendly service ... try ""Maynard's Dove House"" on the beach. This gem has it all and is locally owned and operated. Thank you for making our retreat to Pensacola awesome! We will definitely be back soon!",,,,
407726,138365,"2020-09-27 02:43:46",RazInn,http://www.razinn.com,rrazinn@yahoo.com,"(602) 400-6488","37 W Pasadena Ave",Phoenix,AZ,85013,"37 W Pasadena Ave,Phoenix,AZ 85013","Hotels, Bed & Breakfast & Inns, Condominiums, Lodging, Resorts",,,,33.51021,-112.07714,,"Welcome! Over the years, my wife and I have lived in five countries around the world and now dedicate ourselves to our posada style property in Phoenix. My wife is an American who has traveled the world, resided in Mexico and Spain and speaks fluent Castillian. As for me, I was born in Russia in the former Soviet Republic of Moldova, about a 2 hour drive from Romania. My hometown looks a lot like the Transylvania seen in old American movies.and experience our superior service and worldly charm. Come visit Historic Central Phoenix and spend some time with us.Warmest regards from our family to yours,Ruslan and Erin Razinn","This Bed and Breakfast garden community is located in Uptown Phoenix one mile to downtown, three miles to the upscale Biltmore nightlife, shopping and dining, and six miles to Old Town Scottsdale. We are one block from AJ's gourmet grocer, Bikram yoga, and so much more!! A three minute walk takes you to the Light Rail station and explore Phoenix or transport to the airport.","Mon - Sun: 6:00 am - 11:45 pm","Phone: (602) 803-9575",,"all major credit cards, paypal",,,"View Website",,,,,,,,,
409421,139034,"2020-09-27 02:43:51","Little Creek Cove",,lcc@littlecreekcove.com,"(541) 265-8587","3641 NW Oceanview Dr",Newport,OR,97365,"3641 NW Oceanview Dr,Newport,OR 97365","Hotels, Bed & Breakfast & Inns, Condominiums, Lodging, Motels, Resorts",,,,44.66347,-124.05664,https://i4.ypcdn.com/blob/fadb41bb48b58b183dc8211f4fdcf17d7d5f865c_100x100_crop.jpg?41e4770,,"Property Location With a stay at Little Creek Cove in Newport, you'll be on the beach and minutes from Agate Beach Golf Course, and close to Agate Beach Neighborhood and Dog Park. This beach condo is within close proximity of Yaquina Head Light House and Don Davis Memorial Park. Rooms Treat yourself to a stay in one of the 31 individually decorated guestrooms, featuring fireplaces and LED televisions. Rooms have private furnished balconies. Kitchens are outfitted with full-sized refrigerators/freezers, stovetops, and microwaves. Cable programming and DVD players are provided for your entertainment, while complimentary wireless Internet access keeps you connected. Amenities Take in the views from a garden and make use of amenities such as complimentary wireless Internet access and barbecue grills. Getting to nearby attractions is a breeze with the area shuttle (surcharge). Business, Other Amenities The front desk is staffed during limited hours. Free self parking is available onsite.","Mon - Sun: 8:00 am - 8:00 pm","Phone: (541) 265-4576 Fax: (541) 265-4576 Fax Number: (541) 265-4576 TollFree: (800) 294-8025",,"master card, visa, amex, discover, all major credit cards, diners club",,,,"Parking: Lot Wi-Fi: Free Price Range : Average Check-In Time: 4 PM Check-Out Time: noon Property Amenities: Designated smoking areas, Garden, Barbecue grill(s), Beach towels, Area shuttle (surcharge), Front desk (limited hours) Room Amenities: Daily housekeeping, Yard, Shower/tub combination, Dishwasher, Fireplace, Hair dryer, Phone, Full-sized refrigerator/freezer, Separate dining area, Furnished balcony, Cookware, dishware, and utensils, Kitchen, Iron/ironing board, Cable TV service, Access via exterior corridors, Free local calls, Separate living room, LED TV, Coffee/tea maker, Stovetop, Private bathroom (not in room), Blackout drapes/curtains, Microwave, Individually decorated, Individually furnished, DVD player, Premium TV channels Pets Allowed: No",,,,,,,,
418405,142630,"2020-09-27 02:44:08","Kumulani Vacations & Realty Inc",http://www.kumulani.com,Info@kumulani.com,"(808) 879-9272","115 E Lipoa St Ste 205",Kihei,HI,96753,"115 E Lipoa St Ste 205,Kihei,HI 96753","Vacation Homes Rentals & Sales, Bed & Breakfast & Inns, Camps-Recreational, Condominium Management, Condominiums, Hotels, Lodging, Real Estate Agents, Real Estate Buyer Brokers, Real Estate Management, Real Estate Rental Service, Resorts",,,A+,20.74867,-156.4518,https://i4.ypcdn.com/blob/3dbdb67760d1a63adb6c3592b4614c3d7093e93e_100x100_crop.jpg?41e4770,,,"Mon - Fri: 8:00 am - 4:00 pm","Phone: (808) 871-6609 Primary Phone: (808) 874-0094 Phone: (808) 874-0094 Fax: (808) 874-0094 TollFree: (800) 367-2954",,"all major credit cards, discover, invoicing available, master card, visa, amex",,"Kumulani Vacations and Realty, Inc.","http://www.kumulani.com https://kumulani.com",,,,,,,,,
421560,143896,"2020-09-27 02:44:14","Beachside Motel",http://www.beachsidemotel.com,rentals@beachsidemotel.com,"(904) 601-2615","3172 S Fletcher Ave","Fernandina Beach",FL,32034,"3172 S Fletcher Ave,Fernandina Beach,FL 32034","Condominiums, Bed & Breakfast & Inns, Hotels, Lodging, Motels, Real Estate Rental Service, Resorts",,,,30.62183,-81.43975,https://i3.ypcdn.com/blob/f211a315a1ded787a57df818f01f10918ff91acf_100x100_crop.jpg?d9a04b5,"Since 1977","Property Location With a stay at Beachside Motel in Fernandina Beach (Amelia Island) which is oceanfront, you'll be convenient to Fernandina Beach Golf Club and Island Falls Golf. This beach motel sit on the beach, and is within close proximity of Peters Point Beach Front Park and Palmetto Walk Shopping Village. Rooms Make yourself at home in one of the 20 air-conditioned guestrooms. Complimentary wireless Internet access keeps you connected, and cable programming is available for your entertainment. Bathrooms have shower/tub combinations and complimentary toiletries. Conveniences include phones with free local calls, and housekeeping is provided daily. Rec, Spa, Premium Amenities Take advantage of recreation opportunities such as an outdoor pool, or other amenities including complimentary wireless Internet access and a television in the lobby. Business, Other Amenities Free self parking is available onsite.","Mon - Sun: Open 24 Hours","TollFree: (877) 261-4236",,"visa, discover, mastercard, all major credit cards, check, debit, travelers checks, amex",,,http://www.beachsidemotel.com,"Parking: Self Wi-Fi: Free Swimming Pool: Outdoor Check-In Time: 4 PM Check-Out Time: 11 AM Property Amenities: Free breakfast, Front desk (limited hours) Room Amenities: Daily housekeeping, Shower/tub combination, Access via exterior corridors, Phone, Cable TV service, Free local calls, Air conditioning, Connecting/adjoining rooms available, Partially open bathroom",,,,,,,,
423845,144869,"2020-09-27 02:44:23","Amelia Island Vacation",http://www.ameliaislandvacation.com,info@elizabethpointelodge.com,"(904) 277-4851","98 S Fletcher Ave","Fernandina Beach",FL,32034,"98 S Fletcher Ave,Fernandina Beach,FL 32034","Vacation Homes Rentals & Sales, Bed & Breakfast & Inns, Condominium Management, Condominiums, Lodging, Real Estate Management, Resorts",,,A,30.66635,-81.43131,,,,"Mon - Sun: Open 24 Hours","TollFree: (800) 772-3359",,"amex, mastercard, visa, discover",,"Amelia Island Vacation.Com Ameliaislandvacation.com","http://www.ameliaislandvacation.com https://ameliaislandvacation.com",,,,,,,,,
429774,147273,"2020-09-27 02:44:49","Maui Vacations",http://lahainamauihawaii.com,melinda@maui.net,"(808) 661-8040",,Lahaina,HI,96761,"Lahaina,HI 96761","Vacation Homes Rentals & Sales, Bed & Breakfast & Inns, Condominium Management, Condominiums, Hotels, Lodging, Real Estate Management, Real Estate Rental Service",,,,,,https://i4.ypcdn.com/blob/7ea6c6ee0d5860d927fe4df57d44f53f3c886555_100x100_crop.jpg?41e4770,"Maui Vacation Rental Condos & Homes in Lahaina & West Coast of Maui","Offering vacation rental condos, homes, and budget accommodations in Lahaina Town and along the West Coast of Maui, Hawaii! We work with over 50+ properties for you to choose from! We'll be happy to assist you in finding just the right accommodations for you to enjoy a wonderful vacation on Maui! Lahaina Shores Beach Resort is our premier beachfront property in Lahaina, Maui, Hawaii. Offering beautifully remodeled and decorated Mountain View and Oceanfront Studios, One Bedrooms and Penthouses. Walking distance to the harbor, shops, restaurants, nightlife and art galleries in quaint and colorful Lahaina Town.",,"TollFree: (800) 480-8455",,"all major credit cards, master card, visa, mastercard, amex",,,"http://lahainamauihawaii.com http://lahainamauicondos.com http://alohalaniinn.com","Wi-Fi: No Wheelchair Accessible: Yes Bike Parking: Yes Attire: Casual Takes Reservations: No Outdoor Seating: Yes Specialties: Vacation Property, Houses, Leasing & Rental, Residential Property, Homes Drive Through: No Parking: Lot, Private",,,,,,,,
432093,148209,"2020-09-27 02:44:54","Ocean Isle Inn",http://www.oceanisleinn.com,info@oceanisleinn.com,"(910) 579-0750","37 W First St","Ocean Isle Beach",NC,28469,"37 W First St,Ocean Isle Beach,NC 28469","Lodging, Beaches, Bed & Breakfast & Inns, Condominiums, Hotels, Marriage Ceremonies, Motels, Wedding Chapels & Ceremonies, Wedding Planning & Consultants, Wedding Reception Locations & Services, Wedding Supplies & Services",5,"25 Reviews",A+,33.88638,-78.44001,https://i3.ypcdn.com/blob/e244e30b1d32c2f700f384418264cf56543e1146_100x100_crop.jpg?d9a04b5,,"Property Location With a stay at Ocean Isle Inn in Ocean Isle Beach, you'll be on the beach and minutes from Museum of Coastal Carolina, and close to Ocean Isle Beach. This beach hotel is within the vicinity of Ingram Planetarium and Leopard's Chase Golf Club. Rooms Make yourself at home in one of the 70 air-conditioned rooms featuring refrigerators and microwaves. Complimentary wireless Internet access keeps you connected, and cable programming is available for your entertainment. Bathrooms have shower/tub combinations and hair dryers. Conveniences include phones, as well as coffee/tea makers and irons/ironing boards. Amenities Enjoy a range of recreational amenities, including an outdoor pool, an indoor pool, and a spa tub. This hotel also features complimentary wireless Internet access, wedding services, and a picnic area. Dining A complimentary continental breakfast is included. Business, Other Amenities Featured amenities include limo/town car service, a computer station, and express check-out. Event facilities at this hotel consist of conference space and a meeting room. Free self parking is available onsite.","Mon - Sun: Open 24 Hours","Phone: (910) 830-3052 Phone: (910) 579-1319 Fax: (713) 333-9944 Fax: (910) 579-1319 TollFree: (800) 352-5988",,check,,,http://www.oceanisleinn.com,"Parking: Street, Self, On Site, Free, Private Wi-Fi: Free Wheelchair Accessible: Yes Price Range : Average Swimming Pool: Indoor, Outdoor Check-In Time: 3 PM Check-Out Time: 11 AM Hotel Features: Room Service, Car Rental Desk, Family Rooms Property Amenities: Picnic area, Express check-out, Elevator/lift, Free breakfast, Designated smoking areas, Safe-deposit box at front desk, Designated smoking areas (fines apply), Spa tub, Garden, Computer station, 24-hour front desk, Limo or Town Car service available, Library, Wedding services, Conference space Room Amenities: Daily housekeeping, Shower/tub combination, Private bathroom, Phone, Hair dryer, Premium bedding, Air conditioning, Refrigerator, Blackout drapes/curtains, Microwave, Iron/ironing board, Access via exterior corridors, Cable TV service, Connecting/adjoining rooms available, Coffee/tea maker, Premium TV channels Takes Reservations: No Bike Parking: Yes Pets Allowed: No Outdoor Seating: Yes",pammow,08/14/2013,five,"Oceanfront at it's best right here. We didn't have to commit to a week like you do with most beach houses/condos. We stayed here a few days and really enjoyed it. The food was good, the service was great, and our vacation at the inn was memorable. I want to come back real soon.",barbiecasey,07/23/2013,five,"Ocean Isle Inn was a very nice place to stay in Ocean Isle Beach. We were here for the weekend for a wedding and it was beautiful. The area was landscaped very nice and perfect for a beach wedding."
439156,151037,"2020-09-27 02:45:05","Stowe Mountain Resort",http://www.stowe.com,stoweinfo@vailresorts.com,"(802) 253-3000","5781 Mountain Rd",Stowe,VT,05672,"5781 Mountain Rd,Stowe,VT 05672","Condominium Management, Bed & Breakfast & Inns, Condominiums, Resorts",4,"11 Reviews",A+,44.5108,-72.76505,https://i4.ypcdn.com/blob/4161e017f093c917aa8df99a2354ddce84cb4676_100x100_crop.jpg?41e4770,,"A classic Vermont ski getaway, popular with families because of its excellent ski/snowboard school and child-friendly amenities.","Mon - Sun: 7:30 am - 6:00 pm","Phone: (802) 253-3519 Phone: (802) 253-3406 Phone: (802) 253-3656 Phone: (802) 253-2263 Fax: (802) 253-3406 TollFree: (888) 253-4849 TollFree: (800) 253-4754",,"all major credit cards, cash, check",,"Stowe Mountain Performing Arts Mt. Mansfield Co. Inn At The Mountain Mt Mansfield Co Inc Mount Mansfield Co Inc Mansfield Cafe Stowe Mountain Auto Toll Road",http://www.stowe.com,"Parking: Lot",purplesage,04/15/2008,five,"I spent many school vacations at Stowe with my Aunt Linda and Uncle Charlie Lord. I was there when it was just beginning to become popular. I loved it then and still do even though I haven't been back for a few years. Getting a bit too old to travel now. It's a wonderful place. Unfortunately, I never learned to ski. Uncle Charlie didn't seem to have the patience for me. The town still needs a regular stop light at the beginning of the mountain road. That flashing red light isn't going to do it.",jb716,11/21/2006,three,"The town of Stowe is beautiful and it is nice to see that not only 25 year olds ski/board and go out at night! But the skiing is certainly NOT anywhere NEAR the best. I really don't know how you could even begin ot say that. I was there for an afternoon and did the whole mountain. I went back to killington for the rest of my vacation. the lines for the gondola were very long and the lifts take forever. the terrain is mixed at best and there is very little of it. Killington, Sunday river, attitash, bretton woods....they all clean stowe's clocks for skiing. But you can't beat the town and that is why I will return this year-just with very low expectations for skiing. Oh and beware-moderate winds close the mountain. this was the case two our of three days when we should have been there-thank goodness we left and went to killington to ski!"
724706,249195,"2020-09-27 02:54:32","Days Inn Arlington Six Flags Ballpark AT&T Stadium",http://www.daysinn.com/hotels/texas/arlington/days-inn-six-flags-ballpark-at-and-t-stadium/hotel-overview?hotel_id=06151,,"(817) 261-8444","910 N Collins St",Arlington,TX,76011,"910 N Collins St,Arlington,TX 76011","Hotels, Bed & Breakfast & Inns, Lodging, Motels, Parking Lots & Garages",,,,32.74867,-97.09801,https://i4.ypcdn.com/blob/4d59cdcacfdbcbffaafadac9a671cd43bc2a1775_100x100_crop.jpg?63f80dd,"Closest Hotel to AT&T Stadium, Walking Distance to Rangers Ballpark, Globe Life Park, and Near Six Flags","Closest Hotel to AT&T Stadium, Walking Distance to Rangers Ballpark and Near Six Flags. Walk to big-time fun when you stay at our Days Inn Arlington Six Flags/Ballpark/AT&T Stadium hotel, the closest hotel to Cowboys Stadium - AT&T Stadium. Enjoy sightseeing on the free city Trolley to nearby Six Flags Hurricane Harbor, Arlington Convention Center, the University of Texas at Arlington or College Park Center. You can also spend the day splashing and swimming in our refreshing outdoor pool","Mon - Sun: Open 24 Hours","Fax: (817) 860-2299",,"visa, master card, amex, discover, cash, all major credit cards, mastercard, diners club",,,"http://www.daysinn.com/hotels/texas/arlington/days-inn-six-flags-ballpark-at-and-t-stadium/hotel-overview?hotel_id=06151 hotel website","Parking: Lot",,,,,,,,