category_2_x_jiamengdian.id,category_2.id,category_2.ts,category_2.title,category_2.category_1,category_1.id,category_1.ts,category_1.title,jiamengdian.id,jiamengdian.ts,jiamengdian.title,jiamengdian.gongsi,jiamengdian.touzie,jiamengdian.hangye,jiamengdian.mendian,jiamengdian.biaoqian,jiamengdian.gongsi_beijing,jiamengdian.jiameng_youshi,jiamengdian.jiameng_tiaojian,jiamengdian.jiameng_zhichi,jiamengdian.jiameng_liucheng,jiamengdian.jingying_moshi,jiamengdian.pinpai_yuandi,jiamengdian.hetong_qixian,jiamengdian.jingying_chanpin,jiamengdian.shihe_renqun,jiamengdian.zhaoshang_wangzhi
1,1,"2018-06-13 02:20:33",烘焙店,餐饮,1,"2018-06-12 23:37:56",餐饮,1,"2018-06-13 02:03:42",法式皇家烘焙,武汉麦村餐饮管理有限公司,"20-30 万",餐饮,300家,餐饮烘焙店,,,,,,,,,,,
2,1,"2018-06-13 02:20:33",烘焙店,餐饮,1,"2018-06-12 23:37:56",餐饮,2,"2018-06-13 02:03:42",澳典烘焙,青岛澳典企业管理有限公司,"20-30 万",餐饮,78家,餐饮烘焙店,,,,,,,,,,,
3,1,"2018-06-13 02:20:33",烘焙店,餐饮,1,"2018-06-12 23:37:56",餐饮,3,"2018-06-13 04:36:38",零点烘焙,上海贵峰食品有限公司,"5-10 万",餐饮,3家,餐饮烘焙店,,,,,,特许,上海,2年,,自由创业、在岗投资、毕业生创业,https://www.qj.com.cn/brand/lingdian/index/
4,1,"2018-06-13 02:20:33",烘焙店,餐饮,1,"2018-06-12 23:37:56",餐饮,4,"2018-06-13 04:36:42",烘焙大师,香港卡罗美食品有限公司,"50-100 万",餐饮,12家,餐饮烘焙店,"上海卡罗美食品有限公司是陆仕企业集团在上海投资的具有前瞻性的新概念烘焙连锁店。卡罗美以經营Carême烘焙大师品牌，开发精致健康美味之烘焙产品&飲料的複合連鎖事業体 ，卡罗美突破传统的烘焙产品营销概念，纯欧式风格，以全新的经营理念，创意营销新概念，力求产品的精致、新鲜、健康、美味。卡罗美让追求时尚，关注健康与休闲的白领们不仅体验烘焙大师产品的精致美味，更能享受到烘焙大师的自由自在的第三生活空间，并体味浓郁的烘焙文化。上海卡罗美食品有限公司設立日期：2004年4月14日核准成立。主要業務：开发精致健康美味之烘焙产品&飲料複合連鎖事業体目前门店：18家（上海：三鑫店、永泰店、紫薇店等 江苏：南京店、扬州店、湖塘店、吴江店等） 資 本 額：160 萬美元員工人數：台籍幹部 6人 / 正式員工約160人工　　廠：上海浦東新區川六路1000號面　　積：10甲(公頃)/150畝/100,000平方米品牌定位 门店定位时尚人群 第三生活空间 健康精致的流行天地 现代都会型时尚指标地带 自由自在休闲环境 经营定位纯欧洲风格 现场烘焙 复合式连锁经营模式 全新经营理念 创意营销新概念 营销定位（好吃又好玩）西点BUFFET-好吃！蛋糕、饼干DIY-好玩！ 诠释吃的过程感受玩的乐趣 丰富的西点派对领略做蛋糕、饼干的情趣 更多选择用心感悟体会亲手制作的过程 全力体验瞬间感觉赋予产品非凡生命 享用完美西点精髓玩出美味与新鲜 产品定位新鲜----现场烘焙 健康----科学配方 美味----独到技术",,,,,"直营,特许",香港,3年,糕点,"自由创业 在岗投资 毕业生创业",https://www.qj.com.cn/brand/careme/index/
5,1,"2018-06-13 02:20:33",烘焙店,餐饮,1,"2018-06-12 23:37:56",餐饮,5,"2018-06-13 04:37:21",英伦时光面包烘焙,英伦典范国际品牌管理（北京）有限公司,"10-20 万",餐饮,200家,餐饮烘焙店,"英伦时光面包烘焙是英伦典范国际品牌管理（北京）有限公司旗下的品牌。英伦典范国际品牌管理（北京）有限公司简称英伦国际，成立于2012年7月1日，是一家致力于高端品牌管理和服务的公司。 我们拥有强大而专业的管理团队，资深的品牌设计团队，精湛的运营团队和优秀的研发团队。公司全力为客户提供专业，高效、多样而有竞争力的合作开店服务。英伦国际公司组织架构明确，董事会下辖理事会负责管理品牌各项事务。理事会下辖英伦国际公司总部和培训研发中心，以及直营店三大板块。公司总部分设招商部、运营部、客服部、设计部、企划部、财务部、行政人事部等七大部门，分别处理各项事务。公司在短短一年多时间内，由最初的二十几名员工，发展到了现在的二百六十余名员工。 2013年6月，英伦国际位于上海新茂大厦12层的上海分公司成立。英伦国际旗下还拥有“英伦风情”（牛排西餐），“英式小站”（休闲餐饮）和“海洋之心”（钻石珠宝）三个品牌，并拥有英伦时光咖啡西餐厅、英伦小站特色甜品饮料站、英伦风情牛排西餐厅、海洋之心钻石珠宝店等多个项目。目前，公司已经在全国各省市自治区拥有200余家不同规模签约店铺，为各地合作商提供了一系列周到全面的品牌合作服务。从前期的店铺定位选址、装潢设计，到店铺配套软硬件设施的供应、店员的招聘和培训、特色产品的研发，再到随后的品牌宣传、广告投放、运营管理、营销方案等都有我公司专业人员全程、周到的指导和服务。自2013年4月底至11月初，我们的开业店铺多达近百家。英伦时光品牌已经在全国拥有一定知名度，多次创造餐饮行业奇迹，各地开业门店均创造了良好的运营业绩，是当地休闲餐饮消费的时尚先锋。自成立以来，公司一直致力于打造高效，全方位的品牌合作服务，在店铺服务标准化体系，产品结构研发创新上均有与国际接轨的超高水平。务实、专业、创新，是公司全体员工奋斗的目标。保持品牌持久的生命力是我们对合作商的承诺。我们将及时准确地把握市场，不断创新，持续为所有的合作伙伴提供最新，最全，最有效的来源和品牌服务。","英伦时光面包烘焙加盟优势 1、多元产品，灵活组合英伦时光（Eng Time）为满足不同需求的投资，经多年的市场实战经验，特制定了极具有市场竞争力的系列产品，包括：面包甜点、咖啡饮品、手工巧克力、意大利冰淇淋、特色欧洲小吃、欧洲经典美食等几大类，每款产品均出自英伦时光（Eng Time）产品研发中心的精心创意，独具英伦特色。各产品系列均可以根据所店面位置、面积、商圈特点等进行灵活、合理组合，打造经营灵活、独具特色、复合型的品牌经营模式！2、国际品牌，底蕴深厚英伦时光（Eng Time）不仅秉承英式下午茶底蕴，更首创将下午茶文化完美融入面包烘焙坊经营模式中，使客人时刻感受到英式下午茶般的舒适与悠闲！而这种生活方式正是当前都市消费者所向往和青睐的。“源于英伦，畅享时光”的独特经营理念是对英伦时光（Eng Time）品牌文化的最好诠释！3、英伦装潢，乐活真谛英伦时光（Eng Time）在店面装修上充分体现了英式美学风范，经典的英伦风情融合现代英伦时尚，为消费者带来早期欧洲文化和现代欧洲文化的时光交错感，空气中弥漫着烘焙面包和研磨咖啡的醇香，使人如痴如醉。无论是英式早餐、午餐、晚餐，还是让时光慢下来的英式下午茶，都会让您在这里感受到西餐美食文化的真谛！4、英式服务，尊贵享受英伦时光（Eng Time）独特的“英式服务理念”，让客人感受到的尊崇享受。服务是面包烘焙坊经营中的重中之重，服务水平决定着面包烘焙坊经营的成败！英伦时光（Eng Time）独特的“英式服务理念”包括：△英式大管家服务；△精致生活源于细节；△为顾客创造生活情趣；△服务无止境，创新永追求；△以人为本，品质改变生活。5全程托管，合作无忧英伦时光（Eng Time）特别引入英式管理模式，对加盟客户进行“英式管家”式的服务支持，从开店前对当地市场分析考察、店面选址、装修设计监理、人员培训、带店管理、市场营销等环节都做到专业化管理、专人专项负责制，让品牌连锁店的发展更稳妥、运营更高效！","英伦时光面包烘焙加盟条件 1、具有法人资格或合法经营资格。2、有理性的投资心态，能够客观的看待投资与回报的关系。3、加盟商遵守经营理念，认同公司企业文化和管理模式，服从英伦时光面包烘焙加盟总部机构管理，积极配合总部的市场运作，遵纪守法，规范经营。4、具备足够资金实力，可满足英伦时光面包烘焙加盟资金投资要求。5、具备一定的市场开发能力和管理能力。6、能够遵守公司的保密协议，不向竞争对手透露公司详细情况。","英伦时光面包烘焙加盟支持 一、开业赠送1、“英伦时光”品牌商标在合作期间免费使用。2、配送基础型专业烘焙设备及辅助用品。3、专业评估团队亲赴当地对店面及市场做详细调查与评估，因地制宜制定策划运营方案。对于店址的评估、选择、营业额预估等，总部仅提供建议参考，不做任何保证。4、实地测量店面尺寸，与合作商沟通设计思路定位。5、全套店面装修设计方案（平面图、3D效果图、CAD施工建议图等）施工图纸，装修期间如有特殊情况，设计师或工程监理人员赴现场指导工作。6、全套店长、员工服装；店铺经营管理手册，店长、员工、技师管理手册，技术操作等运营手册。7、免费培训：店长、裱花师、烘焙师各一名，可到总部接受实地操作理论培训。包括：店面管理、原料管理、店面营销、生产计划等理论课程。8、全套专属“英伦时光”品牌VI光盘，音乐光盘、贵宾卡、开业宣传单等店铺运营海报设计支持工作。二、后续服务1、为合作商统一代购所有所需高级专业烘焙设备、展柜及食品模具系列用品。2、开业期间，总部派负责开店店长及专业技术人员带店指导。3、长期给合作商提供产品包材，原料及辅料总部统一采购服务。4、长期对合作商新产品开发及培训指导，长期为店铺提供节假日营销活动策划，长期对店铺提供管理咨询服务。5、终身提供店铺日后运营升级管理系统的建设工作。",,"合作,混合",英国,0年,"面包 餐饮",任何人,https://www.qj.com.cn/brand/etime1928/index/
6,1,"2018-06-13 02:20:33",烘焙店,餐饮,1,"2018-06-12 23:37:56",餐饮,6,"2018-06-13 04:37:24",味多美,味多美食品有限责任公司,未知,餐饮,300家,餐饮烘焙店,"味多美创立于1996年，是国内著名烘焙连锁食品品牌，主要经营产品包括蛋糕、面包、咖啡、中西式点心、月饼、粽子等。成立至今，在中国已创办了300余家直营连锁店，2010—2011年相继落户天津、上海、河北、包头等地。味多美在北京、上海、包头同时拥有现代化的中央工厂，集“生产”“配送”“销售”为一体，专业的品质管理制度，保证食品安全。味多美品牌定位于中高端消费者，以丰富的、高品质的产品，平民化的价格，亲切友善的服务，便利的连锁店铺，赢得了消费者的青睐。现今味多美正以每年30-50%的速度向全国快速扩张，到2015年连锁店数量将达到800家。届时味多美将立足于全国市场，以创新的观念，结合各地的饮食特点，将让全国各地更多的消费者品味到味多美的烘焙美食与创意激情。 用艺术的灵感追逐每一个美味旋律，从世界各地采撷来的多种健康原料，用创意的心和精湛的技术，将世界各地的美好，汇聚在你的舌尖。味多美，发现纯粹美味！","味多美加盟优势 1、成本优势：通过产品和有效的运营成本控制，给予加盟合作伙伴最大的让利空间2、信息优势：与世界最新的信息更新系统保持高度同步3、规模优势：大规模生产基地，现代化的先进生产线4、管理优势：人性化的现代管理机制，优势的综合管理系统和多层面的管理经验","味多美加盟条件 1.能够全身心投入到味多美的经营中，且具备一定的市场敏感度。2.本人及家人身体健康，有从事本行业的激情和热情。3.认可并接受味多美的经营理念和模式，有志于创造投资的人。4.提供合法身份证，以便总部建立真实的档案。5.执行和遵守味多美的各项经营管理体系。6.具有独立法人资格或经济实力较强的自然人。7.具有良好的合作意识、良好的商业信誉。","味多美加盟支持 1.完善的品质保证，客户回头率极高；2.全国统一品牌，统一零售价；3.在约定的条件下，为加盟商提供优质的售后服务，保证在代理区域内味多美品牌独家经营权；4.完善的区域保护措施、拒绝串货流通；5.先进的营销策划，印刷宣传品，现场助销POP、品牌形象附料等及时配送；6.不断创新的尖端产品，源源不断；7.定期活动支持，根据季节及人文体系每月制定不同的促销方案。","味多美加盟流程 1、 向总部咨询、填制味多美相关申请表格；2、 提供加盟商的资质证明、身份证明、目标市场的分析报告和经营计划；3、 提交候选店的照片、商圈位置图、装修方案；4、 提交加盟费用、签订特许加盟协议；5、 总部进行考察、评估、审核；6、 技术培训和宣传支持；7、 加盟店试营业、开业。注：本项目投资金额、加盟店数量、招商加盟地区和经营模式，请以最新咨询为准！我们建议您在本品牌主页下方【留言板留言】 或致电咨询，您即可与企业免费通话并及时获得加盟项目最新动态（企业要求各不一，建议了解多个项目做对比）。",直营,中国,0年,蛋糕、面包、咖啡、中西式点心、月饼、粽子等,自由创业、在岗投资、毕业生创业,https://www.qj.com.cn/brand/wdmcake/index/
7,1,"2018-06-13 02:20:33",烘焙店,餐饮,1,"2018-06-12 23:37:56",餐饮,7,"2018-06-13 04:37:25",卡西雅面包烘焙,广州市百悦餐饮管理有限公司,未知,餐饮,5家,餐饮烘焙店,"Casya卡西雅，本着“以客户为尊、团结向上、以人为本、开拓创新”的经营目标迈进烘焙行业领军者的队列之中。Casya卡西雅主营品类包括西式面包、生日蛋糕、甜甜圈、慕思西点、芝士蛋糕、中秋月饼、泡芙系列、葡式蛋挞、饮品咖啡、台湾奶茶、巧克力、烘焙饼干、烘焙吐司、果冻布丁等……每一位卡西雅人都将奉献健康、美味食品视为自己永恒的事业和毕生的理想。带着追梦的翅膀翱翔在卡西雅永恒的天下。 2006年 Casya卡西雅的主属公司香港国力国际集团有限公司在香港成立，成立之初，公司主要架构由品牌运营团队和产品研发团队构成，主营西式面包并以外包加工为主。随着Casya卡西雅首家直营店和加盟店分别在香港、台湾相继开业，揭开了Casya卡西雅从一个籍籍无名的烘焙品牌、成长为一个拥有30多个专卖店的大型烘焙企业的序幕。 2007年 Casya卡西雅一站式专业烘焙经营概念开始成形。在Casya卡西雅的产品机构中，逐渐引入咖啡饮品类相关产品，巧克力，果冻布丁等与品牌主营产品相关的品类走入消费者的视野，这是Casya卡西雅全品类时尚休闲烘焙概念成形和企业经营策略转型的初期。 2008年 Casya卡西雅的首家合作设备工厂在中国设备基地广州成立，结束了品牌产品设备外包的历史，同时为企业的研发提供了强有力的后勤保障。同年，Casya卡西雅成立产品研发中心，实现了所有产品都经过自行调研、开发、生产、品检、销售的过程。 2009年 Casya卡西雅迅速扩展到全国一线城市，并辐射经济发达的二三线城市。Casya卡西雅的直营事业与合作加盟都取得了长足发展，Casya卡西雅逐步占领部分一线城市重点商圈，品牌开始初具今日现代Casya卡西雅的雏形。 2010年 Casya卡西雅继续不断发展。总部在运作经验积累的基础上，提出了“以诚信为根本、服务为依托、市场为载体、视质量为生命”的理念，竭诚为广大顾客服务的概念。把产品重心放在烘焙专卖一站式解决方案上，以现代都市时尚休闲烘焙需要，为顾客提供良好感受被视为Casya卡西雅品牌发展的一个前提条件。 2011年 广州市百悦餐饮管理有限公司的成立拉开了Casya卡西雅全面进入大陆市场的序幕。公司展开了轰轰烈烈的品牌“再造工程”，定位于“我的专属烘焙”的第三代终端形象推出，店铺更注重综合出品的展示和销售，一个全品类的烘焙休闲场逐步完善成型。对原有店铺，Casya卡西雅进行了大规模的改造，以确保为追随高品质烘焙美味产品的时尚人群提供良好的氛围和感受。 2012年 Casya卡西雅烘焙专卖在国内进入高速扩张期，一站式解决方案得以进一步实践，在着名烘焙大师JACQUES“超现代时尚”理念的基础上，结合现代烘焙发展趋势，为终端提供前沿畅销产品。 2013年 Casya卡西雅全面启动全品类经营模式，产品线覆盖西式面包、生日蛋糕、甜甜圈、慕思西点、芝士蛋糕、中秋月饼、泡芙系列、葡式蛋挞、饮品咖啡、台湾奶茶、巧克力、烘焙饼干、烘焙吐司、果冻布丁等品类，从而为品牌高速发展打开全新局面。“烘焙+时尚饮品+超前沿产品”全品类经营模式，开创了休闲烘焙行业新蓝海。",,,,,"特许,合作",广州,0年,烘焙,自由创业、在岗投资、毕业生创业,https://www.qj.com.cn/brand/casya/index/
8,1,"2018-06-13 02:20:33",烘焙店,餐饮,1,"2018-06-12 23:37:56",餐饮,8,"2018-06-13 04:37:30",可心DIY烘焙生活馆,珠海市金鼎可心烘焙生活馆,"5-10 万",餐饮,200家,餐饮烘焙店,"可心DIY烘焙生活馆品牌详情： 我们的“生活馆”，它不是谈产品，而是销售一种不一样的生活方式，它就是一种情感体验的销售场所，在这里，家具、瓷砖、窗帘、灯饰、等一切元素被捆绑在一起，配合音乐、美术，以及切身的体验过程，给消费者一个生活场景展示。在这样浪漫温馨的场景里，由我们提供烘焙指导，消费者亲自动手，从而创作出凝聚了其作者情感的的西点作品，这种经历这种体验将给消费者留下非常美好的回忆。 我们从2009年初开始对该项目进行严谨的考察与市场调查，经过综合分析发现该项目市场容量巨大，有非常好的挖掘潜力，能力强项目前景好，于是我们在2009年底开始寻址与装修，于2010年3月正式开业。由于本项目精心策划、定位准确，宣传得当，我们一炮而红，开业第一个月就开始，随后营业额逐步稳健上升。 可心DIY烘焙发展至今，已经成为了当地规模最大、品牌效应最强的DIY烘焙会所，并在全国拥有20多家加盟店，可心DIY生活馆已经形成了集各类DIY西点烘焙、烘焙课程学习、朋友聚会Party、外场DIY烘焙活动的服务等为一体的时尚休闲生活馆，与多个楼盘、企业、汽车4S店有长期的合作关系，为传递烘焙的文化、内涵及人文情感做着不懈的努力。 在宣传策划方面，我们与北京师范大学珠海分校传播学和广告学专业的“整合营销”团队达成长期合作协议，他们负责对我们提供全面的策划、营销、包装与宣传工作，通过整合营销推广机会分析（SWOT分析），分析了我们这个项目的整体优势、劣势、机会与威胁，分析并识别了我的目标消费群和潜在消费群，这样就确定了我们要以打造一个DIY烘焙品牌为目标，以文化情感为这个品牌的载体，以此定位来展开对它进行营销与经营活动，从而建立我们自己的品牌文化及其文化内涵。 在烘焙技术方面，前期我们先后分别从专业饼店和星级酒店加盟加盟招聘专业西点烘焙师傅，组成了自己的专业烘焙师团队，后期我们集众家之所长，对原有的烘焙项目进行优化与改进，同时研发了不少的烘焙新品，通过这些积累与沉淀，我们形成了可心独有的完善的技术体系与培训体系。 同时，在日常的工作中，我们也形成并完善了自身的运营体系，使得日常工作能有条不紊、稳中有进的开展下去。在我们不遗余力的打造、培养与传播品牌的种种努力下，我们积累了一大批忠实的客户群，品牌知名度在当地迅速打开，经过多年的发展与创新，可心DIY烘焙的业务呈现多元化，店面的赢利点呈复合式发展结构，已经吸引了包括《致富时代》、《大众投资指南》等多家媒体对我们的关注，从而对我们可心进行了全面的报道，可心的前景一片大好。 从2011年3月开始，我们在全球最大的华人网络社区－“天涯社区”的创业论坛发布了可心DIY的创业故事,该贴一经发布马上引起了论坛的轰动，我们以此普及了DIY烘焙文化，并引发了一场DIY烘焙的创业热潮，一时跟从者众，吸引了无数人对可心的模仿，甚至出现了山寨“可心DIY”；而我们在开店前经过调研而撰写的《关于开办DIY烘焙坊的项目计划书》也被百度收入“百度文库”，成为立志于开办DIY烘焙项目创业者重要的参考资料，自此，可心成为了DIY烘焙的行业标杆。 梦想有多大，舞台就有多大！2012年6月起，可心DIY开始启动全国连锁加盟的体系工作，我们期待着和一群怀揣梦想、志同道合的年轻人携手共进，一起谱写我们的人生故事！ 项目的可行性分析： DIY烘焙在一些大的城市已经受到青年白领、年轻妈 妈和学生们的喜爱，它从传统的烘焙行业细分出来，定位于年轻消费者，通过消费者自己DIY烘焙与制作，赋予了一份西点的情感与生命，这样我们就让一份西点 “活”了起来，消费者自己DIY西点既能体验到亲手制作乐趣，又能通过它传情达意，再加上一分温馨的创意，这个项目已经很受欢迎。 但纵观现有的DIY烘焙市场现状，没有一个注重其品牌的建设，如果不以打造一个品牌建设一个品牌为目的的话，那他们都仅仅只是搭了一个DIY烘焙的架子，没有品牌独特的内涵与灵魂 在物质文化极其丰富的今天，人们已经不仅仅满足于温饱问题的追求，精神层面的追求才是现今人们所注重的，所以精神层面的主张对于一个品牌是非常重要的，于是可心的DIY烘焙以情感文化为载体来满足人们的情感诉求，这就是我们“可心”品牌的核心竞争力。 可心品牌的策划与营销方式能在消费者接触到我们的第一时间里打动他们，这种情感诉求的表达直达人们内心最深处，引起他们与我们的共鸣与互动，亲情、友情与 爱情在我们可心DIY的平台上找到了最好的的诉求方式，于是我们这个品牌赢得了人们的喜爱与消费者的认同，其品牌竞争力不是一般DIY烘焙店能比 肩的。 所以，本项目是一个投入不大，资金门槛不高，可观，操作简易、具有文化内涵的一个新项目，有很大的持续性与发展空间，其市场空间大且接纳度高，项目可行性非常大。 7大加盟优势 1、强大的品牌优势 可心品牌文化感强，我们所主张的文化情感包装与营销在同类市场独树一帜，非常容易吸引大群客户群体；正因为如此鲜明的品牌特色，可心DIY一开办就收到多 家媒体的关注与报道，而我们在开店前经过调研而撰写的开店方案也被百度收入“百度文库”，成为立志于开办DIY烘焙项目创业者重要的参考资料，自此，可心 成为了DIY烘焙的行业标杆。 2、齐全的货物配送 我们赠送加盟店所有的烘焙器材及主要原料，每一种器材数量都充分考虑了一个备用性和实效性而有多个数量，每种原材产品都获得国家食品QS认证，符合国家最高 级食品质量标准，并且大部分是进口原料。设备加原料共计一百多个品种，几千个数量，重达几百公斤，并且有后续的货物配送支持，完全无后顾之忧。 3、系统的培训与实习 我们的培训是免费的包食宿的培训，让加盟商有宾至如归的感觉；培训不限制时间，学会为止。培训内容包括针对性极强的DIY烘焙技术、管理经验、经营技巧与 营销等方面的知识。我们一对一的手把手的教，在可心直营店边培训边实习，并辅以我们自编的《可心烘焙操作指南》，上手非常快； 我们的培训让加盟商不走弯路，短时间快速掌握开办DIY烘焙的各项技能，降低时间与资金成本并迅速提高和扩大知名度；而且我们会根据加盟商各时期所遇到的困难提供帮助，解决问题； 4、丰富的DIY烘焙品类及优良的口感 我们的DIY烘焙品类除了各种口味的戚风蛋糕、芝士蛋糕、提拉米苏、慕斯蛋糕外，还有包括曲奇、泡芙、披萨、巧克力、蛋挞、果冻、布丁、月饼等在内的多个 品种；我们的西点配方经过多位专业饼店和星级酒店西点师傅们的研发与改良，集众家之所长，最后沉淀为属于我们可心独特的西式美味。 5、多年的成功营销经验共享 我们有着多年的成功营销经验，旗下的两家直营店，一家位于郊区的高校里，一家位于市中心，针对于不同的顾客群体我们有不同的营销方式，加盟培训除了烘焙技术的培训之外，营销培训也是我们的培训重点。 6、独具品牌文化的广告支持 加盟店在以后日常的运作中，能及时的享受由总部提供的极具可心品牌文化内涵的节日海报、宣传单页、文化产品等，这些属于可心自己的品牌文化，能让加盟店在 当地迅速的提升品牌知名度，这种的可心情感文化，能迅速的培养我们的忠实客户群体，抢占当地DIY烘焙市场，提升加盟店的能力。 7、贴心的后续支持 我们的加盟店在开业后，持续不断的享受总部给予的烘焙技术支持、货物配送支持、每季节假日活动海报支持、营销技术支持等，所有这些给予加盟店支持的工作全部由总店店长亲自负责，这样流程简单、反应迅速，避免了过多繁缛复杂的程序与损耗，大大的提高了工作效率。 加盟方案： 加盟费：4.8万元，5000元品牌保证金（合同到期，无息返还），1000元/年品牌管理费、不再有其他任何费用。 加盟商能享受到我们提供的如下服务： 1、 我们提供包食宿的烘焙技术、店面运营、管理、宣传、营销等全方位的培训，培训是一对一手把手的教，不限制培训时间，学会为止； 2、 赠送开店所需的烘焙器材、烤箱、原料及包装，共计一百多个品种，几千个数量，重达几百公斤； 3、提供店面选址与装修设计的指导； 4、 赠送新店开业所需要用到的宣传单、海报、会员卡、积分卡、纪念卡等等； 5、 赠送由我们精心编制的《可心DIY烘焙操作指南》，里面包含几十种烘焙品类的配方及操作流程； 6、 赠送4套员工工作服、20套顾客烘焙服； 7、 赠送2套包含烘焙品目照片、价格和文案的可心特色价目单；赠送相当数量的蛋糕创意图片；赠送两本可心精美画册； 8、赠送可心文化相框一套（一个系列，8幅）； 9、 授权使用可心注册商标，及可心VI系统； 可心投资分析 一、投资预算 加盟费（4.8万）+装修（2万）+电器（0.6万）+其他（0.1万）＝7.5万 注： 1）以50平米店为分析案例； 2）本预算不含铺租，视不同地方不同的铺租具体分析； 3）电器是指空调、冰箱、灯具等； 4）其他费用是包含：相关证件办理费用、开业需要购买的一些杂物等； 二、 以每天平均12人进店消费为例，每人消费80元，店内月营业额＝12人x80元x30天＝28800元 店内毛利＝营业额x85%＝24480元 店内纯利＝店内毛利－租金3000元－水电500元－人工3000元＝17980元 外场活动：1500元（最保守估计，每月一次的外场活动，每次纯利1500元） 每月纯利：店内纯利+外场活动纯利＝19480元 每年纯利：每月纯利x12月＝233760元 注： 1）本例以大城市为分析目标； 2）以上回报数据按第一年以后的平均业绩进行估算，非开业第一年的回报； 3）实际情况会因城市、商圈、个人经营管理的差异而不同，仅供参考； 9大加盟支持 筹备期： 1、提供商标及VI使用等相关文件授权书； 2、提供店面选址、装修、布置的指导，协助制定相关店面管理制度； 3、提供运营管理的支持和服务，提供人员招聘的指导和培训； 4、提供各种宣传资料及开业策划方案； 运营期 5、提供优质烘焙原料及相关包品的配发货支持； 6、不定期提供烘焙新品及相关培训； 7、提供店面烘焙技术支持与日常运营管理支持； 8、协助与制定各类营销活动策划方案； 9、提供相关市场策划和广告宣传方案； 加盟条件： 我们对加盟者的第一要求是要有长远的经营眼光，而不是只顾眼前利益的经营者。我们要求加盟店的经营者有文化追求、遵守商业信誉，不以高额为唯一追求目标的人。 1、有个人资金调度及债信能力，资金取得合法，财务资信良好； 2、具有积极进取的事业心，热爱烘焙，对未来的加盟店能全身心的投入； 3、具备品牌意识，理解并接受可心的经营理念和企业文化； 4、 具有长期合作意向，能自觉遵守可心的各项规章和制度； 5、具有较强的处理人际关系和财务管理能力，在当地社会关系良好。 6、愿意参加总部的培训和接受总部的各项管理。 7、 店址需经可心总部认可，店面要按照可心的统一VI设计装修方案； 8、本人及家庭的健康状况良好,并得到家人和亲友的支持。",,,,,"特许,合作",广东,0年,DIY蛋糕、DIY面包、DIY西点、DIY月饼、DIY甜品,自由创业、在岗投资、毕业生创业,https://www.qj.com.cn/brand/kexindiy/index/
9,1,"2018-06-13 02:20:33",烘焙店,餐饮,1,"2018-06-12 23:37:56",餐饮,9,"2018-06-13 04:37:35",新法澳泽,广州昌启餐饮管理有限公司,"5-10 万",餐饮,20家,餐饮烘焙店,"　　品牌故事：19世纪中，生活在法国卡瓦永小镇的澳泽家族，看中法式面包广阔的前景，也为重振家族昔日的辉煌，澳泽后人以姓氏Orser为店名，开始自营家传烘焙手艺，开了一家法式传统面包店。　　香港宏达创建实业有限公司创始人曾经旅法十年。他发现法国人热爱生活，也很会生活，他们善于控制生活节奏，善于忙里偷闲懂得如何充分享受人生，细细咀嚼生命的深邃滋味。最终他发现:慢活，是一种态度，一种生活方式，更是一种能力。而这种能力正是目前经济高速发展压力空前的环境下，国内精英人群所迫切需要的。　　于是，他花了将近三年时间来构思如何将这种法式慢生活理念带入国内。最终看中以健康为本，秉承法国百年精湛烘焙工艺、淬炼法式传统文化精髓的Orser烘焙! 决定将其引入国内。希望以Orser为依托，将法式慢生活理念引进国内帮助人们开拓生活空间，提高生活质量，提升生活境界!产品得到消费者广为认可，澳泽烘焙于2017年正式更名为“新法澳泽”将产品与服务进一步升级，希望把更美味的法式烘焙带给大家。　　品牌理念：　　浪漫悠闲，是法国人的清雅情趣，也是法国人的生活艺术。这种悠闲不是懒散，不是无所事事，而是开拓生活空间，提升生活境界。是一种人生哲理演化而来的生活方式和精神状态，是超凡脱俗的一种生命自由度。品味生活，是一种生活方式，一种态度，更是一种能力。","新法澳泽加盟优势 　　1、品种丰富，品质一流：采用国外先进设备和制作工艺，由海内外专家亲自督制，严格运用科学管理方法，向广大消费者提供制作精细、风味独特、品种繁多的中高档面包糕点食品。　　2、国际品牌，底蕴深厚：澳泽作为一个拥有欧洲贵族血统的面包品牌，坚持选用国际高端原材料，遵循欧洲传统工艺配方，世界金牌烘焙大师主理，以其独家工艺、浑厚口感、使公司的制作工艺水平处于高端领先地位。　　3、法式风格，浪漫情怀：法国烘焙食品一直在世界上享有盛誉，是每个美食爱好者向往之地。思菲伦由法国名师带教，并全部选用法国原产小麦粉制作而成，出品从色泽、香气到口感，处处都突显正宗，让您享受来自法国的浪漫情怀。注重生活品质，从选择思菲伦开始!　　4、贴心服务，尊贵享受：引进国际先进管理模式，将经营管理的全过程分解细化，实现了各岗位、各工作、各工序的标准化管理。注重细节的装修设计，合理的成本投资，稳定合理的消费价位，独特的企业文化精神，高品质高效率的服务质量，为每一位顾客带来最尊贵至上的享受。　　5、全程扶持，合作无忧：从开店前对当地市场分析考察、店面选址、装修设计监理、人员培训、带店管理、市场营销等环节都做到专业化管理、专人专项负责制，让品牌连锁店的发展更稳妥、运营更高效.","新法澳泽加盟条件 1.具备一定的商业背景和经商经验，熟悉当地市场2.有一定的经济和投资实力，有良好的信誉 3.具有致力于烘焙事业的创业热情，专心专注、敬业上进 4.了解、信任澳泽，在经营理念和发展思路上能达成共识 5.对投资风险和收益的两面性有正确的认知和充分的心理准备 6.具有法人资格和合法经营资格，合作伙伴需要明确主次","新法澳泽加盟支持 　　产品支持　　持有法国蓝带国际厨艺学院法式甜点证书的国际甜点师领衔组成研发团队，以法式传统烘焙工艺技术融入潮流趋势，保证经典法式品味的同时，更能以源源不断的产品创新为品牌注入新的生命力。　　技术培训　　优秀的师资力量与科学的培训|体系相辅相成，对于每一个客户，都有制定详尽的培训内容和计划让其将实际操作与理论融会贯通，达到科学的培训成果。　　物料支持　　长期为客户提供“澳泽”品牌专用物料、设备、器具、餐具、服装等耗材。　　驻店督导　　开业期间均可享受总部提供的驻店服务。后期总部的培训师不定期到各合作店巡店指导经营，对各地技术人员、服务人员进行系统化的后续培训指导。　　市场指引　　各加盟店可随时向总部反馈当地市场行情及建议、总部会根据各门店实际运营中遇到的问题进行分析并给出合理的指引。例如:各类产品的销售情况、节假日促销方案的进展和成效等。　　经营支持　　整合国际前沿经营管理营销理念，紧密结合中国国情和餐饮行业结构，制定科学的经营管理制度及营运管理模式。","新法澳泽加盟流程 　　1、了解项目　　联系招商专员，获得基本投资资料，了解投资需求。　　2、申请加盟　　投资意向与项目咨询，递交合作申请。　　3、公司审核　　昌启集团总部进行具体的合作资质评估。　　4、签订合同　　总部提供可行性方案，进行签约，同时授予特许经营证书及牌照。　　5、产品培训　　根据开业计划，提前选送人员到总部或直营店接受产品制作以及店务培训。　　6、协助选址　　总部协助客户店铺选址，并设计店铺装修效果图稿。　　7、师傅驻店　　总部将派专职人员负责跟踪辅导为您解决实际困难，并进一步传授经验技巧。　　8、正式开业　　全程跟进店铺经营管理，提供长期店铺运营支持。","直营,自由连锁",法国,0年,面包，蛋糕，西点，西饼，水吧,自由创业、在岗投资、毕业生创业,https://www.qj.com.cn/brand/pg731/index/
10,1,"2018-06-13 02:20:33",烘焙店,餐饮,1,"2018-06-12 23:37:56",餐饮,10,"2018-06-13 04:37:40",起司宝贝,昆山昱棋餐饮管理有限公司,"5-10 万",餐饮,8家,餐饮烘焙店,"cheesebaby是一群对起司蛋糕热爱的80后，从一开始，他们就决心要用最天然和上好的原料将蛋糕呈现给他的客人。 而从父辈就开始的烘焙家族产业也让cheesebaby传承了扎实的烘焙手工技艺，为了做出最好最正宗的轻起司蛋糕他们远渡东瀛学习，并与日本最好的起司蛋糕制作团队合作，作为他们的技术支持。他们始终坚持每个蛋糕都通过传统古法的手工制作，因为他相信从他们手心中传达的温暖和爱意可以制作出最令人感动的蛋糕，他们也相信蛋糕的生命力只限于它出炉后的一个小时，所以他坚持现烘现卖的售卖方式，得以为客人提供最棒的蛋糕。 每45分钟新鲜出炉“热烘烘”的现烘起司蛋糕是起司宝贝家的当家花旦。的超人气，几乎路过的人都会被这从店内弥漫出来的浓浓乳酪香味而吸引，继而不得不心甘情愿地排队等候这难得的美味出炉！因为我们采用的是100%纯天然原物料，没有任何添加剂，芳香剂，所以为了保证蛋糕浓郁的口感和自然的芳香，我们对于乳酪，天然乳脂奶油的比例会比通常外面的起司蛋糕要多增加1成。同时我们也毫不夸张的可以告诉你我们在做起司蛋糕时不添加一滴水，我们全部采用100%的德国纯鲜牛乳。这样的用料怎会让你收到这个蛋糕时失望呢？更复杂工艺的蒸烤法现烘蛋糕。我们对于美味总有更多的耐心。 采用需更多时间烤制，对火候工序更多讲究的“蒸烤法”来出品这款美味。铁盘不再是直接在烤箱中高温直烤，而是用隔水的工艺低温精烤，45分钟才能出炉。如此繁杂的纯手工制烤使得我们的起司蛋糕口感上不但松软，而且也更湿润温和。坚持现烘现售，蛋糕是有生命的！cheesebaby一向认为蛋糕是有生命的！他的黄金一刻就是在刚出炉的那刻起的一小时之内。此时的起司蛋糕，比起外面绝大多数“冷冰冰的起司蛋糕”更多了一份温暖，而正是这个刚出炉的温度提升出蛋糕本身的芝士芬芳。刚刚烤出来的起司蛋糕，浑身上下透着金光。蛋糕酥软而有弹性。内里温润绵密。咬上一口，松软幼滑的蛋糕体包裹住感觉刚刚好的芝士味道，不会很甜，也不会太腻，清新又不失乳酪芳香的口感让你在那一刻知道什么叫做“幸福感”！由日本KYOHO商社技术研发，浓郁金黄色的乳酪好似秋天颜色，满嘴的乳酪醇香，齿间飘逸着牛油的香味，更能满足您对各种不同口味的追求采用现场烘培方式制作新鲜，美味，可口的各式乳酪芝士蛋糕；言之就有一种悠悠清香淡淡翠色轻轻上扬沁人心脾.",,,,,"直营,特许,混合,自由连锁",日本,3年,现烘起司蛋糕,"自由创业 在岗投资 毕业生创业",https://www.qj.com.cn/brand/cheesebaby/index/
11,1,"2018-06-13 02:20:33",烘焙店,餐饮,1,"2018-06-12 23:37:56",餐饮,11,"2018-06-13 04:37:42",爱里烘焙,济南爱里企业管理咨询有限公司,"30-50 万",餐饮,157家,餐饮烘焙店,"济南爱里企业管理咨询有限公司隶属于香港爱里国际集团，开办华人第一蛋糕连锁品牌----爱里烘焙连锁专门店。 烘焙连锁事业是国内近三年来的新兴行业，爱里食品以味新奇，包装精美，口感好的优点，赢得了国人的认可，过生日，送礼族的队伍在不断扩大，用低糖健康食品消费、送礼，在某种程度上已成为一种时尚潮流，因此，烘焙食品连锁店越来越炙手可热。 公司创建“爱里”以来，一直致力于以“直营与加盟连锁”方式拓展市场，同时不断地整合优化各种社会资源和行业资源，将全新的爱里烘焙食品连锁店理念带入全国各地区，运用全国的商业平台，通过专业的营销队伍，专家研发产品，精选原材料、名牌厂家直接采购等等。公司用先进的经营理念，科学的管理系统，优越的软硬件设施来加快自己前进的步伐，做到“人无我有，人有我优，人优我新”！庞大的产品研发队伍，不间断的更新速度，越趋便宜的供销价格，先进便利的POS管理系统，无差别的物流配送，勿容置疑的品牌力量等深受连锁店的爱戴和拥护，全方位的培训和良好的企业文化底蕴更吸引了大批立志从事本行业的优秀人才。是以“轻简创业，取财有道”！　　爱里蛋糕品牌对每一个连锁店都尽心竭力，从店址选择，店内装修，店员培训，产品定位产品配送，店面运营，广告宣传，提供一整套的营销支持。时尚的蛋糕和新鲜出炉的面包，独特的装饰风格，新颖的营销模式，充满了美丽家乡情调的购物环境，为追求高品位，个性化的人们提供了艺术与时尚的购物空间。美味、时尚、健康的烘焙食品已成为中国大众的消费趋势，宏伟的事业蓝图正在迅猛展开。　　我们诚邀您的加入，共创“爱里”蛋糕品牌连锁事业的财富盛宴，共创双赢未来！",,,,,"直营,特许,合作,混合,自由连锁",山东济南,0年,蛋糕连锁加盟,"自由创业 在岗投资 毕业生创业",https://www.qj.com.cn/brand/ailijmasdf/index/
12,1,"2018-06-13 02:20:33",烘焙店,餐饮,1,"2018-06-12 23:37:56",餐饮,12,"2018-06-13 04:37:44",好来屋烘焙,北京金奥恒丰国际酒店管理公司,"10-20 万",餐饮,200家,餐饮烘焙店,"好来屋（Hollywood Baking）时尚烘焙是北京金奥恒丰国际酒店管理有限公司旗下品牌，以品质闻名遐迩，带给人们关于浪漫、惊喜，独特的美妙时刻。 在韩国、首尔，在伦敦，在布宜诺斯艾利斯，在每个浪漫的时刻，年轻时尚男女享受着好来屋烘焙带给味觉专属爱的时光；一同分享经典烘焙美味的甜蜜与多滋，体验爱情世界美满的幸福一刻。 好来屋时尚烘焙隶属于北京金奥恒丰国际酒店管理有限公司。公司始终将每项产品的品质放在第一位。每一道繁琐的工序，每一次精雕细琢的烹调，只为最原汁原味的异国餐饮及文化品味体验带给每位顾客。 中国西餐行业迅速发展，除上海、广州、北京、深圳一线城市市场成熟外，杭州、大连、天津、海南、福建、成都、西安、武汉、重庆、西藏、南昌、南宁等现阶段都处于迅速的发展中… 好来屋烘焙在中国市场的发展特点 好来屋烘焙发展迅速、灵活多样、紧跟时代。 好来屋烘焙的糕点品种并不多，不是仅靠品种繁多的餐点来吸引顾客，而是更重视营造一种文化氛围，其中包括餐厅的装饰品，根据用餐形式筛选出不同节奏形式的音乐，为顾客创造了丰厚的就餐附加值。 品牌树立完整，极具吸引力。好来屋烘焙品牌建设的成熟性，为好来屋烘焙在中国市场的发展提供了必要条件。 卫生、安全、节约吸引了高层次的消费。好来屋烘焙从进货到厨房，从原料选择到制作，从营养搭配到出品都遵循西方传统的卫生营养原则，讲求原汁原味，对原料营养保存完好，吸引了广大顾客。厨师，带您走进国际餐厅。好来屋烘焙拥有的糕点师，每份烘焙都是由主厨精心设计制作完成。 好来屋烘焙的生命力在于吸引中国的消费者。中国的西餐要面向中国的消费者，才有发展前途，才有生命力，好来屋烘焙采用的小麦粉烘焙而成，消费者可放心食用。 好来屋烘焙承诺： 每一款产品都让人体验出用心做出来的温馨 好来屋烘焙品牌基础： 以精湛的制作工艺和善良的心为基础 精选上等优质原料，放心食用：好来屋时尚烘焙精选上等优质原料，使用法国进口AOC黄油、法国进口法芙娜巧克力及北爱尔兰 进口蓝米吉奶油等优质原料制作面包及蛋糕，让您放心食用。 现场制作，每日新鲜：好来屋时尚烘焙在店铺内现场烘焙面包、现场制作蛋糕、三明治、饮料等产品，每日制作保证了产品新鲜、健康及美味。 合作支持：品牌形象、管理及培训、店面选址与设计 本项目投资金额、加盟店数量、招商地区和经营模式，请以最新咨询为准！我们建议您在 【留言板留言】 或致电咨询，您即可与企业免费通话并及时获得项目最新动态（企业要求各不一，建议了解多个项目做对比）。 更多加盟项目请登陆https://www.qj.com.cn了解。",,,,,"直营,自由连锁",韩国,0年,面包烘焙，蛋糕烘焙，西点系列，韩式甜品,"自由创业 在岗投资 毕业生创业",https://www.qj.com.cn/brand/hlwbread/index/
13,1,"2018-06-13 02:20:33",烘焙店,餐饮,1,"2018-06-12 23:37:56",餐饮,13,"2018-06-13 04:37:46",CLBAKE枫培,广州市万旭餐饮管理有限公司,"1-5 万",餐饮,100家,餐饮烘焙店,"广州万旭餐饮是一家专业餐饮投资和运营管理机构，专注于发掘和培育全球有潜力的餐饮品牌。选址于写字楼林立，商机遍布的广州CBD中心—珠江新城。坐拥珠江一线繁华江景，交通资源配置发达，紧邻广州新地标—小蛮腰(广州新电视塔)，和广州歌剧院、博物院、图书馆为伴，人文气息浓厚，商业和艺术氛围相得益彰。 欧洲特色结合东方消费习惯，真正适合大陆口味 旗下品牌—CLBAKE枫焙于1950年在香港创建，创始人欧阳森游历各国尝遍世界美食，在意大利Rikota奶酪的基础上，结合国人口味爱好，经过多次实验，最终制作成流行的经典亚洲奶酪挞，深受大众喜爱，在日本、香港等地创造了一天售出100多万奶酪挞的奇迹。 CLBAKE枫培产品特色 CLBAKE枫焙紧紧围绕“新鲜二重烘焙、三种流心芝士、三种食法”的记忆点引导消费新主张。CLBAKE枫焙流心挞由欧洲天然原料制成的三种芝士进行黄金比例搭配，再通过匠心独运的手工细心烘焙最大程度释放芝士里的营养元素，而刚出炉的流心挞会呈现出会呼吸的起伏状，半熟流心入口细腻，因此又故名“可以吸着吃的芝士挞”，使消费者在品尝后能感到好玩，得到口感上的满足，保持一种愉悦的生活态度。 CLBAKE枫焙秉承与更多人一起分享烘焙美食的理念，选用北纬45℃天然牧场的优质原料，搭配独特配方和手工烘焙技艺，创造的烘焙特色美食口味。不单美食，CLBAKE枫焙更强调服务和整体环境的人性化，努力营造一种如家般的感觉。舒适温馨的店面装修，使CLBAKE枫焙店铺整体看起来明亮温暖，橱窗里陈列的糕点像艺术品一样精美，让人垂涎欲滴。CLBAKE枫焙致力于营造如家般温馨品味之感，让顾客体验更完美惬意的休闲时光。 CLBAKE枫培品牌优势 无需店面，经营灵活 简单到一个人、一间房，就可以傻瓜式经营，轻松获取高额! 无需厨师，标准化工艺流程 标准化的工艺流程、标准的原料包、先进的制作设备，一个人就能掌握全部制作过程，无需厨师、服务员。 简单化操作，标准化无限度 总部提供全程培训，专家手把手传授，学会为止，操作非常简单，彻底解除投资者后顾之忧。商业街、学校周围、车站码头、社区都可开店，为您量身打造，实现您的财富梦想。 投资，大回报 总部为中小投资者提供低门槛投资方案，最快当月即可回收成本，创业加盟成功率达到90%以上。 CLBAKE枫培招商加盟 2015年，拥有56年历史的老品牌的CLBAKE枫焙宣布正式进军中国大陆市场，要将美味带给全中国人!经过一年的时间，CLBAKE枫焙加盟店已经在全国全面开花，目前已有100多家加盟店，发展势头相当迅猛。 CLBAKE枫焙的市场表现之所以如此亮眼，除去烘焙市场本身的潜力、CLBAKE枫焙独特口味和产品线之外，CLBAKE枫焙强大的加盟扶持团队功不可没。CLBAKE枫焙运营团队由一批数十年从事烘焙连锁经营的精英组成，为加盟商提供从开业前，试营业，开业后全方位包括开业扶持、管理运营、团队构建、物流配送、上门指导以及前期带店等一站式跟踪服务，确保加盟商能开好店，挣到钱! 由于市场需求旺盛，CLBAKE枫焙项目操作简单，加盟方式灵活，再加上总部完善的扶持政策，据统计，CLBAKE枫焙创业加盟成功率高达90%!2016年，CLBAKE枫焙计划将在亚洲开满500家店。名额有限，想做烘焙店的创业者们，千万不要错过加盟CLBAKE枫焙的机会! 本项目投资金额、加盟店数量、招商地区和经营模式，请以最新咨询为准！我们建议您在下方【留言板留言】 或致电咨询，您即可与企业免费通话并及时获得项目最新动态（企业要求各不一，建议了解多个项目做对比）。 更多加盟项目请登陆 https://www.qj.com.cn/ 了解。",,,,,"直营,特许",香港,1年,烘焙,自由创业者、在岗投资、毕业生创业、其他,https://www.qj.com.cn/brand/CLBAKE/index/
14,1,"2018-06-13 02:20:33",烘焙店,餐饮,1,"2018-06-12 23:37:56",餐饮,14,"2018-06-13 04:37:51",杰瑞布朗,上海桥柏餐饮管理有限公司,"20-30 万",餐饮,80家,餐饮烘焙店,"杰瑞布朗蛋糕是一种现代比较流行的只是当啊，一般是由烤箱制作的，蛋糕是用鸡蛋、奶酪，白糖、小麦粉为主要原料。以牛奶、果汁、奶粉、色拉油、水，起酥油、泡打粉为辅料。经过搅拌、调制、烘烤后制成一种像海绵的蛋糕。 杰瑞布朗蛋糕是一种休闲食品，典型的蛋糕是以烤的方式制作出来，杰瑞布朗蛋糕的材料主要包括了面粉、蛋糕是用鸡蛋、奶酪，白糖、小麦粉为主要原料，倡导新鲜健康，现烤现吃，鲜香浓郁的美味起司，金色蓬松的绵软蛋糕，还有精心专业的烘焙技术，一切都源于经典，而又超越经典，让你情不自禁的对之升腾起无限的美食欲望。杰瑞布朗是家以轻乳酪蛋糕，起司蛋糕与布丁蛋糕，奶盖茶，咖啡等健康休闲甜品与茶饮为一体的复合式专营店，杰瑞布朗品牌在成立之初所倡导的，新鲜，健康，便捷的休闲食品态度不仅在心理上抓住消费者，而且复合式的经营理念，除了蛋糕之外，饮品更在视觉和味觉方面征服了大众。杰瑞布朗品牌产品系列分为，轻乳酪蛋糕系列，布丁蛋糕系列，手工饼干系列，奶盖茶系列，咖啡系列等，多样化的产品，时尚，轻快，明亮的品牌形象设计，给人一种简单，舒适的视觉享受。 “杰瑞布朗”轻乳酪蛋糕依靠丰富的背景资源，在充分引进美国蛋糕技术的同时，还不断研发新的产品，更引入健康无添加的各式甜品，饮品，不但增添了产品的多样性更为顾客提供了更多的选择。 杰瑞布朗坚持采用新鲜，健康好食材为原料，来精心制作每一份乳酪蛋糕，搭配新鲜现制茶饮和手工现烤饼干做出迎合季节性口感的时尚风味，精选上等咖啡豆研磨的特调咖啡更是包罗了不同消费群体的需求。杰瑞布朗品牌力求在最大程度上满足消费者生理和心理的需求，打造健康，时尚，幸福的甜饮品文化。 《现场烘焙》所有起司蛋糕，乳酪蛋糕均在店内现场烘焙，保证蛋糕的新鲜口味。 杰瑞布朗-上帝带给世界的第一口芝士蛋糕，迷幻两岸三地的经典口味，杰瑞布朗疯狂依 旧芝士蛋糕，杰瑞布朗的蛋糕奇幻世界天马行空而来。 杰瑞.布朗，经典品味---你，很有态度！ 你拥有它的魅力.经典.回忆.微笑. 它就像是生活中一个被人们深深记住的符号一般不断的勾起你美丽的向往，时光，梦想，成功，财富，都伴随着甜蜜的味道烙在了金色的蛋糕之上。 加盟优势 ----集團有强大的采購優勢；----區域保障，確保約定區域經營；----强大的後續服務支持、質量穩定、可靠的產品和服務；----“杰瑞布朗”現成的連鎖樣板店可快速啟動，----投資規模較 大者總部還可派人現場培訓指導開業。 杰瑞布朗品牌加盟流程 1，讯息资讯2，加盟面谈3，签订合约4，人员招募5，新店选址6，人员培训7，门店装修设计8，订货与采购9，门店试运营10，正式开业 本项目投资金额、加盟店数量、招商地区和经营模式，请以最新咨询为准！我们建议您在 【留言板留言】 或致电咨询，您即可与企业免费通话并及时获得项目最新动态。前景加盟网，更多加盟项目请登陆https://www.qj.com.cn了解。",,,,,"直营,特许,混合",美国,5年,起士蛋糕，布丁蛋糕，手工饼干，奶盖茶,自由创业，在岗投资，白领创业，公司增项目,https://www.qj.com.cn/brand/jerry/index/
15,1,"2018-06-13 02:20:33",烘焙店,餐饮,1,"2018-06-12 23:37:56",餐饮,15,"2018-06-13 04:37:55",卡诺烘焙,宾澳(北京)餐饮管理有限公司,"30-50 万",餐饮,22家,餐饮烘焙店,"BEANBAR的创始人Ron Basset先生南澳最大咖啡烘焙厂场主Carle Mark先生和宾澳的中国运营团队联手合作,运营高端咖啡连锁企业多年，在中国的高端咖啡市场取得了巨大成功之后，敏锐观察到这一机遇，在悉心研究了这一行业的模式、产品、市场后，适应中国市场现状的量身打造的自主知识产权的民族咖啡品牌。Basset和 Mark先生出于同宾澳集团高层多年合作建立的深厚国际友情，欣然以他们二人的姓氏各取前两个字母命名了品牌""CARO""这个带有西班牙文化格调的品牌名称。“CARO”西班牙语带有高贵尊贵的意思，她很好的诠释了这个品牌的气质和格调。采用最简单的天然成分：卡诺烘焙，只采用最好的天然原料。任何一款我们的产品均不添加防腐剂。我们追求品质，倾注大量的时间，并按照悠久的欧洲传统工艺，为顾客提供最好的面包和烘焙食品。我们对我们的面包感到自豪。我们为我们所有的工作人员提供了一个受人尊重和安全的工作环境，以及一个分享我们成功的机会。我们致力于帮助我们的加盟商提供种类繁多的、独特的和高品质的面包及烘焙食品，以帮助他们从行业竞争中脱颖而出。","卡诺烘焙加盟优势 1、我们的品牌（Our Brand）： 卡诺源自澳洲，在快时尚法式专业烘焙店领域内有专业的产品研发生产体系，供应链管理体系及店面管理体系。承继百年法式烘焙经典技艺和浓厚的烘焙文化，卡诺欧式的店面设计风格及优质的产品线以独树一帜的风格在市场中具有明显的竞争优势。2、设计优势（International Design Team）：据全球最著名的市场调研公司麦肯锡报道，零售消费业态的最核心竞争力来自设计。在快时尚法式专业烘焙领域内，优质的烘焙产品线及时尚舒适的室内环境更是消费者选择品牌的第一驱动因素。2014卡诺烘焙聘请欧洲著名室内设计事务所，推出与欧洲同步全球最佳烘焙店室内设计，为您的投资确保长期竞争优势。同时由国内烘焙专家负责研发更适合国人口味的烘焙产品线，使卡诺的产品口感更加适应国内不同人群的喜好。3、产品线优势（Products Line）：我们为您提供法式专业烘焙领域中最丰富产品线！ 面包16系列135款产品。独具特色的明星产品欧式软包系列，外形像欧式面包，口感外皮酥脆内瓤甜美绵软。4、专业烘焙，品质保证（Bekery Quality）： 我们为客户提供现场烘焙产品，新鲜味美。独特的配方及工艺，专业的供应链原料支持，确保现场制作的品质稳定。5、专业咖啡（Coffee & Beverage）：我们为您提供最专业的意式咖啡产品线！ 咖啡饮品 10系列74款产品，其中包括独具特色的明星产品 BEAN BAR ESPRESSO 系列此外，我们的研发团队每月都会为您提供新的产品。并且，您可以根据本地消费者的偏好，增加特色的本地产品，分2期总体不超过20%。我们的产品线保证80%的统一性和20%的差异性，以适应巨大的中国市场多样性的要求。6、运营优势（Operation Advantage）：中学为体，西学为用，我们的运营管理团队既有来自85度C等外资企业的资深人士以确保运营管理的专业与高效，又有来自国内优秀连锁企业的营销专家以保障店面营销充分接地气。运营经理和您及店经理每周召开工作例会，每月共同制定月度营销计划，以及至始至终的运营督导支持，6大管理模块，35个专业管理工具与全球500强企业同步，用实际行动和专业的服务真正做到和投资人共同发展。7、投资优势（Investment Advantage）：采用哈夫模型，雷利零售引力法则，协助加盟商对所寻地址进行实地考察，对建筑物、商圈、顾客消费群等条件进行调查，评估其运营的可能性。专业选址开发人员替代加盟商与商业地产商谈判，压低房租争取更优惠的条件；海外设计团队设计店面方案、平面方案、灯光效果等视觉效果整案。产品制作培训和管理培训团队建设：通过视频面试和现场评估，帮助加盟商遴选店长店员；运营经理带店，在加盟商培训结束后开业初期，由总部派驻运营经理现场驻店指导各项工作；供应链支持等。","卡诺烘焙加盟条件 (1)、年满20岁以上60岁以下，身体健康，男女皆可。(2)、单人或双人加盟皆可需专职，需专职，可全心投入经营者。(3)、高中职以上程度，免经验，信用良好。(4)、有加盟连锁优势之认知，经营理念相同，对饮品事业具热忱与执著。(5)、加盟主必须亲自参加教育训练，且需通过考核。(6)、所有主体性营业原物料须统一向总公司採购，以维持品牌形象与商品品质一致性。","卡诺烘焙加盟支持 1. 商圈结构分析与选址评估；2. 专业开发人员代替加盟商与商业地产商谈判，压低房租争取更优化的条件；3. 海外设计团队设计店面方案、平面方案、灯光效果等视觉效果整案；4. 产品制作培训和管理组培训（现金管理模块、人员管理模块、进销存模块、设备维护模块、零售促销模块等）；5. 团队建设：通过视频面试和现场评估，帮助加盟商遴选店长、店员;6. 运营经理带店，在加盟商培训结束后开业初期，由总部派驻运营经理现场驻店指导各项工作；7. 经营期间运营支持：总部运营经理和投资人每月召开视频会议，总部运营经理根据各店提供的报表进行数据分析后，指导加盟商店长制定月度工作计划并和投资人一同督促检查，根据实际效果安排促销计划、产品线调整方案、员工在职培训计划和市场推广方案；8. 供应链支持：设备、食材、易耗品遴选业内一流供应商；分ABC-3级采购：A类采购，指卡诺A粉和带LOGO标识的易耗品由总部供应；B类采购是指核准类商品，如辅料、副食等食材由总部同供应商谈好优惠的供应价格，加盟商可以在当地采购以节省物流费用；C类采购指无明显品牌区分的易耗品如蔬菜 水果等。",,"直营,特许",澳洲,0年,"饮品 冰淇淋",自由创业、在岗投资、毕业生创业,https://www.qj.com.cn/brand/caro-coffee/index/