category_1_x_shoubiao.id,category_1.id,category_1.ts,category_1.title,shoubiao.id,shoubiao.ts,shoubiao.title,shoubiao.jiage,shoubiao.yuanjia,shoubiao.xiaoliang,shoubiao.renqi,shoubiao.baoyang,shoubiao.pinpai,shoubiao.chandi,shoubiao.chicun,shoubiao.daxiao,shoubiao.kuanshi,shoubiao.jixin,shoubiao.biaomian,shoubiao.cailiao,shoubiao.biaoshi,shoubiao.gongneng,shoubiao.fujian,shoubiao.youshi,shoubiao.xilie,shoubiao.zhonglei,shoubiao.biaodai,shoubiao.bisoxing,shoubiao.jingmian
1,1,"2018-06-21 03:16:00",顶级品牌,1,"2018-06-22 21:39:27","爱彼-Audemars Piguet 皇家橡树系列 Royal Oak 15400ST.OO.1220ST.02男士机械手表",￥3180,￥7950,1950,2330,"⊙摆放手表的地方尽量放置干燥剂 ⊙皮质的手表应尽量避免接触到水，以免表带变硬、异味，进而导致断裂的情况。 ⊙手表若发生故障的时候，应立即就近送至专门的钟表店检查。 ⊙机械全自动表必须在活动量足够的情況下，即每日必须佩戴10小时以上，方可正常运转。 ⊙不同的场合应佩戴不同的手表，如运动时选用耐震性优良的运动手表。 ⊙表盖上若无标示有防水能力手表表示其防水程度仅限于无压力下的水花或小雨。 ⊙特別提醒大家，任何手表均不宜在温水或浴室佩戴，哪怕您的手表是防水表，因为手表的密封圈是橡胶，受热容易老化，而且四周的水蒸汽分子比较小，很容易渗入表壳，造成內部机械的损坏。 ⊙由于每种手表的内部机械的构造都不同，在正常的使用状态下，机械表或机械全自动表的误差为每日30秒內(次标准为国家部委颁布的)，而石英表的误差较低也比较准确","爱彼-Audemars Piguet 皇家橡树系列 Royal Oak 15400ST.OO.1220ST.02男士机械手表",香港组装,,直径如图所示：4.1CM、厚度0.98CM；,,进口9015改装专用机芯，支持验货后付款。,"100%的抗磨蓝宝石水晶表面（拱形蓝宝石）与同步;历久如新,抗磨抗划.正常佩带可以保持长久不花.的镜面.品质信誉保证.",,"表带，表扣,机芯,表面,表按钮等全部有原厂爱彼标识（更多的细节可通过我们下面附带的图片参考）","内部储能很强，长时间不戴依然走时准确，带日历，100米防水、防震、防磁.316精钢制作,保证其不掉色;实物拍摄,实物还比其更有质感.","配送""爱彼""专用盒,说明书保修卡识别卡等所有附件齐全，让你无论送礼或者自用都尽显非凡.","这款豪华爱彼颠峰设计表,可以使你在日常佩带之时长久保持美观夺目，常带常新；计时准确、造型美观、贴腕设计，质地轻巧、高贵典雅，是现代社会成功人士身份的象征；贴心设计,完全附合你的手腕.",皇家橡树系列,男士手表,钢带表带,圆形表盘,蓝宝石镜面
2,1,"2018-06-21 03:16:00",顶级品牌,2,"2018-06-22 21:39:31","宝玑Breguet CLASSIQUE 经典系列 Classique 5177BR/29/9V6 18K玫瑰金 男士自动机械表",￥2680,￥6700,1362,2269,"⊙摆放手表的地方尽量放置干燥剂 ⊙皮质的手表应尽量避免接触到水，以免表带变硬、异味，进而导致断裂的情况。 ⊙手表若发生故障的时候，应立即就近送至专门的钟表店检查。 ⊙机械全自动表必须在活动量足够的情況下，即每日必须佩戴10小时以上，方可正常运转。 ⊙不同的场合应佩戴不同的手表，如运动时选用耐震性优良的运动手表。 ⊙表盖上若无标示有防水能力手表表示其防水程度仅限于无压力下的水花或小雨。 ⊙特別提醒大家，任何手表均不宜在温水或浴室佩戴，哪怕您的手表是防水表，因为手表的密封圈是橡胶，受热容易老化，而且四周的水蒸汽分子比较小，很容易渗入表壳，造成內部机械的损坏。 ⊙由于每种手表的内部机械的构造都不同，在正常的使用状态下，机械表或机械全自动表的误差为每日30秒內(次标准为国家部委颁布的)，而石英表的误差较低也比较准确","宝玑Breguet CLASSIQUE 经典系列 Classique 5177BR/29/9V6 包18K玫瑰金 男士自动机械表",香港组装,直径：38毫米，厚度：8.25毫米,,男士机械手表,进口全自动2892机械机芯,法国玻璃蓝宝石镜面，不磨损。莫氏9级蓝宝石表面（钻石为10级）,"进口瑞士代工316L精钢表壳或包包18K玫瑰金 真牛皮表带，不掉色、不生锈，高精度蓝宝石玻璃不划损",表面、表背、表扣均有原厂标识,100米防水（可游泳）、防震、防磁,包装盒、吊牌、说明书、发票,,经典系列,男士手表,真皮表带,圆形表盘,蓝宝石镜面
3,1,"2018-06-21 03:16:00",顶级品牌,3,"2018-06-22 21:39:34","瑞士江诗丹顿Vacheron Constantin传承系列85180/000G-9230 男士自动机械腕表",￥2680,￥6700,3213,4022,,"瑞士江诗丹顿Vacheron Constantin传承系列85180/000G-9230","香港组装 【尺寸】直径40毫米、厚度：11MM;男款大数字刻度,适合不同粗细手腕的人佩带. 【颜色】如图显示 【机芯】搭载进口高性能改Cal.2450 sc机械机芯.可长时间精确走时,存储高度能量. 【功能】防水、防震、防磁;精致的阿拉伯经典刻度,指针独特设计,带日历,尽显示你的高贵气质,,优雅首选;背透,全新多功能机芯清晰可见. 【表壳】精钢纯钢表壳,实物拍摄,实物还比图片更有质感的. 【表带】进口设计专用真皮表带,搭配十字花式表扣 【表面】100%高精度蓝宝石表面,历久如新的.抗磨抗划.正常佩带都是不","直径40毫米、厚度：11MM;男款大数字刻度,适合不同粗细手腕的人佩带.",,,"搭载进口高性能改Cal.2450 sc机械机芯.可长时间精确走时,存储高度能量.","100%高精度蓝宝石表面,历久如新的.抗磨抗划.正常佩带都是不会有划痕的.",,"表盘,表背面,表面,表带，表扣等均有VC出产标识","防水、防震、防磁;精致的阿拉伯经典刻度,指针独特设计,带日历,尽显示你的高贵气质,,优雅首选;背透,全新多功能机芯清晰可见.","吊牌说明书;配送""江诗""专用盒送礼、自带彰显品质.","这款豪华江诗丹顿VACHERON CONSTANTIN手表可以使你在日常佩带之时长久保持美观夺目，常带常新；计时准确、造型美观、贴腕设计，质地轻巧、高贵典雅，是现代社会成功人士身份的象征；贴心设计,完全附合你的手腕",传承系列,男士手表,真皮表带,圆形表盘,蓝宝石镜面
4,1,"2018-06-21 03:16:00",顶级品牌,4,"2018-06-22 21:39:38","爱彼皇家橡树系列15451OR.ZZ.1256OR.01腕表 18K玫瑰金 镶钻",￥3680,￥9200,1476,1384,"⊙摆放手表的地方尽量放置干燥剂 ⊙皮质的手表应尽量避免接触到水，以免表带变硬、异味，进而导致断裂的情况。 ⊙手表若发生故障的时候，应立即就近送至专门的钟表店检查。 ⊙机械全自动表必须在活动量足够的情況下，即每日必须佩戴10小时以上，方可正常运转。 ⊙不同的场合应佩戴不同的手表，如运动时选用耐震性优良的运动手表。 ⊙表盖上若无标示有防水能力手表表示其防水程度仅限于无压力下的水花或小雨。 ⊙特別提醒大家，任何手表均不宜在温水或浴室佩戴，哪怕您的手表是防水表，因为手表的密封圈是橡胶，受热容易老化，而且四周的水蒸汽分子比较小，很容易渗入表壳，造成內部机械的损坏。 ⊙由于每种手表的内部机械的构造都不同，在正常的使用状态下，机械表或机械全自动表的误差为每日30秒內(次标准为国家部委颁布的)，而石英表的误差较低也比较准确","【爱彼15451OR.ZZ.1256OR.01】爱彼皇家橡树系列15451OR.ZZ.1256OR.01腕表 包18K玫瑰金 镶钻",香港组装,,"直径如图所示：41毫米、厚度9.8毫米 或 直径：37毫米，厚度：9.8毫米",,进口专用机芯。,"100%的抗磨蓝宝石水晶表面（拱形蓝宝石）与同步;历久如新,抗磨抗划.正常佩带可以保持长久不花.的镜面.品质信誉保证.",,"表带，表扣,机芯,表面,表按钮等全部有原厂爱彼标识（更多的细节可通过我们下面附带的图片参考）","内部储能很强，长时间不戴依然走时准确，带日历，100米防水、防震、防磁.316精钢制作,保证其不掉色;实物拍摄,实物还比其更有质感.","配送""爱彼""专用盒,说明书保修卡识别卡等所有附件齐全，让你无论送礼或者自用都尽显非凡.","这款豪华爱彼颠峰设计表,可以使你在日常佩带之时长久保持美观夺目，常带常新；计时准确、造型美观、贴腕设计，质地轻巧、高贵典雅，是现代社会成功人士身份的象征；贴心设计,完全附合你的手腕.",皇家橡树系列,男士手表,钢带表带,圆形表盘,蓝宝石镜面
5,1,"2018-06-21 03:16:00",顶级品牌,5,"2018-06-22 21:39:42","【高端专供】积家Master Ultra Thin Date超薄日历大师系列腕表1288420 全自动机械男士手表",￥2480,￥6200,2402,4476,"⊙摆放手表的地方尽量放置干燥剂 ⊙皮质的手表应尽量避免接触到水，以免表带变硬、异味，进而导致断裂的情况。 ⊙手表若发生故障的时候，应立即就近送至专门的钟表店检查。 ⊙机械全自动表必须在活动量足够的情況下，即每日必须佩戴10小时以上，方可正常运转。 ⊙不同的场合应佩戴不同的手表，如运动时选用耐震性优良的运动手表。 ⊙表盖上若无标示有防水能力手表表示其防水程度仅限于无压力下的水花或小雨。 ⊙特別提醒大家，任何手表均不宜在温水或浴室佩戴，哪怕您的手表是防水表，因为手表的密封圈是橡胶，受热容易老化，而且四周的水蒸汽分子比较小，很容易渗入表壳，造成內部机械的损坏。 ⊙由于每种手表的内部机械的构造都不同，在正常的使用状态下，机械表或机械全自动表的误差为每日30秒內(次标准为国家部委颁布的)，而石英表的误差较低也比较准确","【积家1288420】一比一积家Master Ultra Thin Date超薄日历大师系列腕表1288420 全自动机械男士手表","香港组装 【尺寸】直径40MM,厚度：7.45MM;适合不同粗细手腕的人佩带. 【颜色】如图显示 【机芯】全自动进口机械机芯.可长时间精确走时,存储高度能量. 【功能】防水、防震、防磁;精致的经典刻度,指针独特设计,带日历,尽显示你的高贵气质,优雅首选;背透,全新进口机芯清晰可见. 【表壳】精钢纯钢表壳,实物拍摄,实物还比图片更有质感的. 【表带】进口设计专用真皮表带,搭配十字花式表扣 【表面】100%高精度蓝宝石表面,历久如新的.抗磨抗划.正常佩带都是不会有划痕的. 【保修】非认为损坏自购买起三年免费保","直径40MM,厚度：7.45MM;适合不同粗细手腕的人佩带.",,,"全自动进口机械机芯.可长时间精确走时,存储高度能量.","100%高精度蓝宝石表面,历久如新的.抗磨抗划.正常佩带都是不会有划痕的.",,"表盘,表背面,表面,表带，表扣等均有积家出产标识","防水、防震、防磁;精致的经典刻度,指针独特设计,带日历,尽显示你的高贵气质,优雅首选;背透,全新进口机芯清晰可见.","吊牌说明书;配送""积家""专用盒送礼、自带彰显品质.","这款豪华积家手表可以使你在日常佩带之时长久保持美观夺目，常带常新；计时准确、造型美观、贴腕设计，质地轻巧、高贵典雅，是现代社会成功人士身份的象征；贴心设计,完全附合你的手腕",大师系列,男士手表,真皮表带,圆形表盘,蓝宝石镜面
6,1,"2018-06-21 03:16:00",顶级品牌,6,"2018-06-22 21:39:44","【高端专供】积家Master Chronograph计时大师系列Q1368420 真日月星辰 腕表男表 全自动机械男士手表",￥3380,￥8450,2952,7852,"⊙摆放手表的地方尽量放置干燥剂 ⊙皮质的手表应尽量避免接触到水，以免表带变硬、异味，进而导致断裂的情况。 ⊙手表若发生故障的时候，应立即就近送至专门的钟表店检查。 ⊙机械全自动表必须在活动量足够的情況下，即每日必须佩戴10小时以上，方可正常运转。 ⊙不同的场合应佩戴不同的手表，如运动时选用耐震性优良的运动手表。 ⊙表盖上若无标示有防水能力手表表示其防水程度仅限于无压力下的水花或小雨。 ⊙特別提醒大家，任何手表均不宜在温水或浴室佩戴，哪怕您的手表是防水表，因为手表的密封圈是橡胶，受热容易老化，而且四周的水蒸汽分子比较小，很容易渗入表壳，造成內部机械的损坏。 ⊙由于每种手表的内部机械的构造都不同，在正常的使用状态下，机械表或机械全自动表的误差为每日30秒內(次标准为国家部委颁布的)，而石英表的误差较低也比较准确","【积家Q1368420】一比一积家Master Chronograph计时大师系列Q1368420 真日月星辰 腕表男表 全自动机械男士手表","香港组装 【尺寸】直径：39MM,厚度：9.9MM;适合不同粗细手腕的人佩带. 【颜色】如图显示 【机芯】改CAL.925全自动机械机芯，真实日月星辰.可长时间精确走时,存储高度能量. 【功能】防水、防震、防磁;精致的经典刻度,指针独特设计,带日历,尽显示你的高贵气质,优雅首选;背透,全新CAL.925机芯清晰可见. 【表壳】精钢纯钢表壳,实物拍摄,实物还比图片更有质感的. 【表带】进口设计专用真皮表带,搭配十字花式表扣 【表面】100%高精度蓝宝石表面,历久如新的.抗磨抗划.正常佩带都是不会有划痕的. ","直径：39MM,厚度：9.9MM;适合不同粗细手腕的人佩带.",,,"改CAL.925全自动机械机芯，真实日月星辰.可长时间精确走时,存储高度能量.","100%高精度蓝宝石表面,历久如新的.抗磨抗划.正常佩带都是不会有划痕的.",,"表盘,表背面,表面,表带，表扣等均有积家出产标识","防水、防震、防磁;精致的经典刻度,指针独特设计,带日历,尽显示你的高贵气质,优雅首选;背透,全新CAL.925机芯清晰可见.","吊牌说明书;配送""积家""专用盒送礼、自带彰显品质.","这款豪华积家手表可以使你在日常佩带之时长久保持美观夺目，常带常新；计时准确、造型美观、贴腕设计，质地轻巧、高贵典雅，是现代社会成功人士身份的象征；贴心设计,完全附合你的手腕",大师系列,男士手表,真皮表带,圆形表盘,蓝宝石镜面
7,1,"2018-06-21 03:16:00",顶级品牌,7,"2018-06-22 21:39:44","【爆款专供】格拉苏蒂 Glashütte Original 1-39-52-01-02-04 男士自动机械手表 香港组装",￥2380,￥5950,2378,1624,,"格拉苏蒂(Glashütte Original)瑞士自动机械表 【产地】瑞士配件瑞士机芯组装.","瑞士配件瑞士机芯组装. 【尺寸】直径：39mm，厚度：10mm.适合不同粗细手腕的人佩带的 【颜色】如图显示,背透机芯.金色壳以及银色壳可选择的(见附图)玫瑰金 【机芯】搭载高性能ETA2824机械机芯，存储能量高达36小时 【功能】内部储能很强，长时间不戴依然走时准确。",直径：39mm，厚度：10mm.适合不同粗细手腕的人佩带的,,,搭载高性能ETA2824机械机芯，存储能量高达36小时,"100%高精度蓝宝石表面,历久如新的.抗磨抗划.正常佩带都是不会有划痕的.",,"表盘,表背面,表面,表带，表扣等均有原厂""格拉苏蒂""出产标识","内部储能很强，长时间不戴依然走时准确。 【表壳】瑞士进口精钢表壳表扣.",吊牌说明书;配送专用盒送礼、自带彰显品质.,"这款豪华格拉苏蒂手表可以使你在日常佩带之时长久保持美观夺目，常带常新；计时准确、造型美观、贴腕设计，质地轻巧、高贵典雅，是现代社会成功人士身份的象征；贴心设计,完全附合你的手腕.",,男表,皮带表带,,蓝宝石
8,1,"2018-06-21 03:16:00",顶级品牌,8,"2018-06-22 21:39:49","瑞士手表 伯爵男表 自动机械 透底 18K玫瑰金金 全玫瑰金 瑞士原装ETA2824-2机芯",￥2580,￥5160,1271,3641,,Piaget伯爵,"瑞士代工配合 香港组装 【款式】：男士自动机械手表 【机芯】：瑞士进口ETA2824-2银色雕花自动机械机芯 25钻 【表面】：法国玻璃蓝宝石镜面，不磨损。莫氏9级蓝宝石表面（钻石为10级） 【材料】：316L精钢表壳，进口316L精钢表链（做工精细、每一小节表链都有一个P字、与同步），高精度蓝宝石玻璃不划损 【尺寸】：直径：3.9CM 厚度：0.95CM 【标识】：表面、表背、表扣均有原厂标识 【功能】：100米防水（可游泳）、防震、防磁 【附件】：包装盒、吊牌、说明书、发票","直径：3.9CM 厚度：0.95CM",,男士自动机械手表,"瑞士进口ETA2824-2银色雕花自动机械机芯 25钻",法国玻璃蓝宝石镜面，不磨损。莫氏9级蓝宝石表面（钻石为10级）,316L精钢表壳，进口316L精钢表链（做工精细、每一小节表链都有一个P字、与同步），高精度蓝宝石玻璃不划损,表面、表背、表扣均有原厂标识,100米防水（可游泳）、防震、防磁,"包装盒、吊牌、说明书、发票 【说明】图片因摄影角度，网上观看会有色差，实物比图片更美观,本商品在交邮递前已经48小时测试，请放心购买！",,ALTIPLANO系列,男士手表,钢带表带,圆形表盘,蓝宝石镜面
9,1,"2018-06-21 03:16:00",顶级品牌,9,"2018-06-22 21:39:52","格拉苏蒂原创 Glashütte Original Senator 精髓系列100-04-32-15-50 18K玫瑰金白盘 男士自动机械表",￥2880,￥7200,2747,919,"⊙摆放手表的地方尽量放置干燥剂 ⊙皮质的手表应尽量避免接触到水，以免表带变硬、异味，进而导致断裂的情况。 ⊙手表若发生故障的时候，应立即就近送至专门的钟表店检查。 ⊙机械全自动表必须在活动量足够的情況下，即每日必须佩戴10小时以上，方可正常运转。 ⊙不同的场合应佩戴不同的手表，如运动时选用耐震性优良的运动手表。 ⊙表盖上若无标示有防水能力手表表示其防水程度仅限于无压力下的水花或小雨。 ⊙特別提醒大家，任何手表均不宜在温水或浴室佩戴，哪怕您的手表是防水表，因为手表的密封圈是橡胶，受热容易老化，而且四周的水蒸汽分子比较小，很容易渗入表壳，造成內部机械的损坏。 ⊙由于每种手表的内部机械的构造都不同，在正常的使用状态下，机械表或机械全自动表的误差为每日30秒內(次标准为国家部委颁布的)，而石英表的误差较低。","格拉苏蒂原创 Glashütte Original Senator 精髓系列100-04-32-15-50 包18K玫瑰金白盘 男士自动机械表","香港组装. 【尺寸】直径：40毫米，厚度：11.52毫米.适合不同粗细手腕的人佩带的 【颜色】如图显示,背透机芯.金色壳以及银色壳可选择的(见附图) 【机芯】搭载高性能进口定制版Cal.100-04机械机芯，存储能量高达48小时 【功能】内部储能很强，长时间不戴依然走时准确。 【表壳】瑞士进口精钢表壳表扣. 【表带】意大利小牛皮真皮表带（可佩鳄鱼皮表带，鳄鱼皮非常昂贵，价格联系客服） 【表面】100%高精度蓝宝石表面,历久如新的.抗磨抗划.正常佩带都是不会有划痕的. 【附件】吊牌说明书;配送专用盒送礼、自",直径：40毫米，厚度：11.52毫米.适合不同粗细手腕的人佩带的,,,搭载高性能进口定制版Cal.100-04机械机芯，存储能量高达48小时,"100%高精度蓝宝石表面,历久如新的.抗磨抗划.正常佩带都是不会有划痕的.",,"表盘,表背面,表面,表带，表扣等均有原厂""格拉苏蒂""出产标识",内部储能很强，长时间不戴依然走时准确。,吊牌说明书;配送专用盒送礼、自带彰显品质.,"这款豪华格拉苏蒂手表可以使你在日常佩带之时长久保持美观夺目，常带常新；计时准确、造型美观、贴腕设计，质地轻巧、高贵典雅，是现代社会成功人士身份的象征；贴心设计,完全附合你的手腕.",精髓系列,男士手表,真皮表带,圆形表盘,蓝宝石镜面
10,1,"2018-06-21 03:16:00",顶级品牌,10,"2018-06-22 21:39:53","AP 爱彼 ROYAL OAK OFFSHORE 皇家橡树离岸型 100-PIECE DOHA LIMITED EDITION 多哈限量版（全球限量100个）26219IO.OO.D005CR.01",￥4180,￥10450,3430,903,"⊙摆放手表的地方尽量放置干燥剂 ⊙皮质的手表应尽量避免接触到水，以免表带变硬、异味，进而导致断裂的情况。 ⊙手表若发生故障的时候，应立即就近送至专门的钟表店检查。 ⊙机械全自动表必须在活动量足够的情況下，即每日必须佩戴10小时以上，方可正常运转。 ⊙不同的场合应佩戴不同的手表，如运动时选用耐震性优良的运动手表。 ⊙表盖上若无标示有防水能力手表表示其防水程度仅限于无压力下的水花或小雨。 ⊙特別提醒大家，任何手表均不宜在温水或浴室佩戴，哪怕您的手表是防水表，因为手表的密封圈是橡胶，受热容易老化，而且四周的水蒸汽分子比较小，很容易渗入表壳，造成內部机械的损坏。 ⊙由于每种手表的内部机械的构造都不同，在正常的使用状态下，机械表或机械全自动表的误差为每日30秒內(次标准为国家部委颁布的)，而石英表的误差较低也比较准确 从未与本店沟通，擅自作出差评，并取消一切售后服务！！！","AP 爱彼 ROYAL OAK OFFSHORE 皇家橡树离岸型 100-PIECE DOHA LIMITED EDITION 多哈限量版（全球限量100个）26219IO.OO.D005CR.01",香港组装,,直径如图所示：42MM、厚度16MM；,,"亚洲ETA-7750 25J 自动计时 28800 VPH，12点小盘秒针。","100%的抗磨蓝宝石水晶表面（拱形蓝宝石）与同步;历久如新,抗磨抗划.正常佩带可以保持长久不花.的镜面.品质信誉保证.",,"表带，表扣,机芯,表面,表按钮等全部有原厂爱彼标识（更多的细节可通过我们下面附带的图片参考）","内部储能很强，长时间不戴依然走时准确，带日历，>50米防水、防震、防磁.316精钢制作,保证其不掉色;实物拍摄,实物还比其更有质感.","配送""爱彼""专用盒,说明书保修卡识别卡等所有附件齐全，让你无论送礼或者自用都尽显非凡.","这款豪华爱彼颠峰设计表,可以使你在日常佩带之时长久保持美观夺目，常带常新；计时准确、造型美观、贴腕设计，质地轻巧、高贵典雅，是现代社会成功人士身份的象征；贴心设计,完全附合你的手腕.",皇家橡树离岸型,男士手表,真皮表带,圆形表盘,蓝宝石镜面
11,1,"2018-06-21 03:16:00",顶级品牌,11,"2018-06-22 21:40:38","【高端专供】积家Jaeger LeCoultre 大师系列Q1372520 18K玫瑰金 积家小丑男表 全自动机械男士手表",￥3380,￥8450,600,3246,"⊙摆放手表的地方尽量放置干燥剂 ⊙皮质的手表应尽量避免接触到水，以免表带变硬、异味，进而导致断裂的情况。 ⊙手表若发生故障的时候，应立即就近送至专门的钟表店检查。 ⊙机械全自动表必须在活动量足够的情況下，即每日必须佩戴10小时以上，方可正常运转。 ⊙不同的场合应佩戴不同的手表，如运动时选用耐震性优良的运动手表。 ⊙表盖上若无标示有防水能力手表表示其防水程度仅限于无压力下的水花或小雨。 ⊙特別提醒大家，任何手表均不宜在温水或浴室佩戴，哪怕您的手表是防水表，因为手表的密封圈是橡胶，受热容易老化，而且四周的水蒸汽分子比较小，很容易渗入表壳，造成內部机械的损坏。 ⊙由于每种手表的内部机械的构造都不同，在正常的使用状态下，机械表或机械全自动表的误差为每日30秒內(次标准为国家部委颁布的)，而石英表的误差较低也比较准确","【积家Q1372520】积家Jaeger LeCoultre 大师系列Q1372520 积家小丑男表 包18K玫瑰金 全自动机械男士手表","香港组装 【尺寸】直径：3.9CM,厚度：0.99CM;适合不同粗细手腕的人佩带. 【颜色】如图显示 【机芯】瑞士进口938全自动机械机芯.可长时间精确走时,存储高度能量. 【功能】防水、防震、防磁;精致的经典刻度,指针独特设计,带日历,尽显示你的高贵气质,优雅首选;背透,全新938机芯清晰可见. 【表壳】精钢纯钢18K包玫瑰金表壳,实物拍摄,实物还比图片更有质感的. 【表带】进口设计专用真皮表带,搭配表扣 【表面】100%高精度蓝宝石表面,历久如新的.抗磨抗划.正常佩带都是不会有划痕的. 【保修】非认为","直径：3.9CM,厚度：0.99CM;适合不同粗细手腕的人佩带.",,,"瑞士进口938全自动机械机芯.可长时间精确走时,存储高度能量.","100%高精度蓝宝石表面,历久如新的.抗磨抗划.正常佩带都是不会有划痕的.",,"表盘,表背面,表面,表带，表扣等均有积家出产标识.","防水、防震、防磁;精致的经典刻度,指针独特设计,带日历,尽显示你的高贵气质,优雅首选;背透,全新938机芯清晰可见.","吊牌说明书;配送""积家""专用盒送礼、自带彰显品质.","这款豪华积家手表可以使你在日常佩带之时长久保持美观夺目，常带常新；计时准确、造型美观、贴腕设计，质地轻巧、高贵典雅，是现代社会成功人士身份的象征；贴心设计,完全附合你的手腕",大师系列,男士手表,真皮表带,圆形表盘,蓝宝石镜面
12,1,"2018-06-21 03:16:00",顶级品牌,12,"2018-06-22 21:40:40","爱彼 Ap Diver 皇家橡树系列 Royal Oak Ref# 26320BA.OO.1220BA.01 白盘 男士自动机械表",￥3580,￥8950,2659,959,"⊙摆放手表的地方尽量放置干燥剂 ⊙皮质的手表应尽量避免接触到水，以免表带变硬、异味，进而导致断裂的情况。 ⊙手表若发生故障的时候，应立即就近送至专门的钟表店检查。 ⊙机械全自动表必须在活动量足够的情況下，即每日必须佩戴10小时以上，方可正常运转。 ⊙不同的场合应佩戴不同的手表，如运动时选用耐震性优良的运动手表。 ⊙表盖上若无标示有防水能力手表表示其防水程度仅限于无压力下的水花或小雨。 ⊙特別提醒大家，任何手表均不宜在温水或浴室佩戴，哪怕您的手表是防水表，因为手表的密封圈是橡胶，受热容易老化，而且四周的水蒸汽分子比较小，很容易渗入表壳，造成內部机械的损坏。 ⊙由于每种手表的内部机械的构造都不同，在正常的使用状态下，机械表或机械全自动表的误差为每日30秒內(次标准为国家部委颁布的)，而石英表的误差较低也比较准确 从未与本店沟通，擅自作出差评，并取消一切售后服务！！！","爱彼 Ap Diver 皇家橡树系列 Royal Oak Ref# 26320BA.OO.1220BA.01 白盘 男士自动机械表",香港组装,,直径如图所示：41MM、厚度10.8MM；,,"7750定制版Calibre 2385机自动机械机芯。","100%的抗磨蓝宝石水晶表面（拱形蓝宝石）与同步;历久如新,抗磨抗划.正常佩带可以保持长久不花.的镜面.品质信誉保证.",,"表带，表扣,机芯,表面,表按钮等全部有原厂爱彼标识（更多的细节可通过我们下面附带的图片参考）","内部储能很强，长时间不戴依然走时准确，带日历，>50米防水、防震、防磁.316精钢制作,保证其不掉色;实物拍摄,实物还比其更有质感.","配送""爱彼""专用盒,说明书保修卡识别卡等所有附件齐全，让你无论送礼或者自用都尽显非凡.","这款豪华爱彼颠峰设计表,可以使你在日常佩带之时长久保持美观夺目，常带常新；计时准确、造型美观、贴腕设计，质地轻巧、高贵典雅，是现代社会成功人士身份的象征；贴心设计,完全附合你的手腕.",皇家橡树系列,男士手表,钢带表带,圆形表盘,蓝宝石镜面
13,1,"2018-06-21 03:16:00",顶级品牌,13,"2018-06-22 21:40:44","爱彼 Ap Diver 皇家橡树系列 Royal Oak Ref# 26320BA.OO.1220BA.02 男士自动机械表",￥3580,￥8950,2513,913,"⊙摆放手表的地方尽量放置干燥剂 ⊙皮质的手表应尽量避免接触到水，以免表带变硬、异味，进而导致断裂的情况。 ⊙手表若发生故障的时候，应立即就近送至专门的钟表店检查。 ⊙机械全自动表必须在活动量足够的情況下，即每日必须佩戴10小时以上，方可正常运转。 ⊙不同的场合应佩戴不同的手表，如运动时选用耐震性优良的运动手表。 ⊙表盖上若无标示有防水能力手表表示其防水程度仅限于无压力下的水花或小雨。 ⊙特別提醒大家，任何手表均不宜在温水或浴室佩戴，哪怕您的手表是防水表，因为手表的密封圈是橡胶，受热容易老化，而且四周的水蒸汽分子比较小，很容易渗入表壳，造成內部机械的损坏。 ⊙由于每种手表的内部机械的构造都不同，在正常的使用状态下，机械表或机械全自动表的误差为每日30秒內(次标准为国家部委颁布的)，而石英表的误差较低也比较准确 从未与本店沟通，擅自作出差评，并取消一切售后服务！！！","爱彼 Ap Diver 皇家橡树系列 Royal Oak Ref# 26320BA.OO.1220BA.02 男士自动机械表",香港组装,,直径如图所示：41MM、厚度10.8MM；,,"7750定制版Calibre 2385机自动机械机芯。","100%的抗磨蓝宝石水晶表面（拱形蓝宝石）与同步;历久如新,抗磨抗划.正常佩带可以保持长久不花.的镜面.品质信誉保证.",,"表带，表扣,机芯,表面,表按钮等全部有原厂爱彼标识（更多的细节可通过我们下面附带的图片参考）","内部储能很强，长时间不戴依然走时准确，带日历，>50米防水、防震、防磁.316精钢制作,保证其不掉色;实物拍摄,实物还比其更有质感.","配送""爱彼""专用盒,说明书保修卡识别卡等所有附件齐全，让你无论送礼或者自用都尽显非凡.","这款豪华爱彼颠峰设计表,可以使你在日常佩带之时长久保持美观夺目，常带常新；计时准确、造型美观、贴腕设计，质地轻巧、高贵典雅，是现代社会成功人士身份的象征；贴心设计,完全附合你的手腕.",皇家橡树系列,男士手表,钢带表带,圆形表盘,蓝宝石镜面
14,1,"2018-06-21 03:16:00",顶级品牌,14,"2018-06-22 21:40:49","格拉苏蒂 Glashütte Original Senator 参议员系列卓越1-39-59-01-12-04 镶钻 男士自动机械手表 香港组装",￥2780,￥6950,3062,692,"⊙摆放手表的地方尽量放置干燥剂 ⊙皮质的手表应尽量避免接触到水，以免表带变硬、异味，进而导致断裂的情况。 ⊙手表若发生故障的时候，应立即就近送至专门的钟表店检查。 ⊙机械全自动表必须在活动量足够的情況下，即每日必须佩戴10小时以上，方可正常运转。 ⊙不同的场合应佩戴不同的手表，如运动时选用耐震性优良的运动手表。 ⊙表盖上若无标示有防水能力手表表示其防水程度仅限于无压力下的水花或小雨。 ⊙特別提醒大家，任何手表均不宜在温水或浴室佩戴，哪怕您的手表是防水表，因为手表的密封圈是橡胶，受热容易老化，而且四周的水蒸汽分子比较小，很容易渗入表壳，造成內部机械的损坏。 ⊙由于每种手表的内部机械的构造都不同，在正常的使用状态下，机械表或机械全自动表的误差为每日30秒內(次标准为国家部委颁布的)，而石英表的误差较低","格拉苏蒂 Glashütte Original Senator 参议员系列卓越1-39-59-01-12-04 镶钻","香港组装. 【尺寸】直径：40mm，厚度：9.4mm.适合不同粗细手腕的人佩带的 【颜色】如图显示,背透机芯.金色壳以及银色壳可选择的(见附图) 【机芯】搭载高性能进口机械机芯，存储能量高达48小时 【功能】内部储能很强，长时间不戴依然走时准确。 【表壳】瑞士进口精钢表壳表扣. 【表带】意大利小牛皮真皮表带（可佩鳄鱼皮表带，鳄鱼皮非常昂贵，价格联系客服） 【表面】100%高精度蓝宝石表面,历久如新的.抗磨抗划.正常佩带都是不会有划痕的. 【附件】吊牌说明书;配送专用盒送礼、自带彰显品质. 【保修】非认为损",直径：40mm，厚度：9.4mm.适合不同粗细手腕的人佩带的,,,搭载高性能进口机械机芯，存储能量高达48小时,"100%高精度蓝宝石表面,历久如新的.抗磨抗划.正常佩带都是不会有划痕的.",,"表盘,表背面,表面,表带，表扣等均有原厂""格拉苏蒂""出产标识",内部储能很强，长时间不戴依然走时准确。,吊牌说明书;配送专用盒送礼、自带彰显品质.,"这款豪华格拉苏蒂手表可以使你在日常佩带之时长久保持美观夺目，常带常新；计时准确、造型美观、贴腕设计，质地轻巧、高贵典雅，是现代社会成功人士身份的象征；贴心设计,完全附合你的手腕.",参议员系列,男士手表,真皮表带,圆形表盘,蓝宝石镜面
15,1,"2018-06-21 03:16:00",顶级品牌,15,"2018-06-22 21:40:50","格拉苏蒂 Glashütte Original Senator 参议员系列卓越 1-39-59-01-15-04 18k玫瑰金 镶钻 男士自动机械手表 香港组装",￥2880,￥7200,1334,631,"⊙摆放手表的地方尽量放置干燥剂 ⊙皮质的手表应尽量避免接触到水，以免表带变硬、异味，进而导致断裂的情况。 ⊙手表若发生故障的时候，应立即就近送至专门的钟表店检查。 ⊙机械全自动表必须在活动量足够的情況下，即每日必须佩戴10小时以上，方可正常运转。 ⊙不同的场合应佩戴不同的手表，如运动时选用耐震性优良的运动手表。 ⊙表盖上若无标示有防水能力手表表示其防水程度仅限于无压力下的水花或小雨。 ⊙特別提醒大家，任何手表均不宜在温水或浴室佩戴，哪怕您的手表是防水表，因为手表的密封圈是橡胶，受热容易老化，而且四周的水蒸汽分子比较小，很容易渗入表壳，造成內部机械的损坏。 ⊙由于每种手表的内部机械的构造都不同，在正常的使用状态下，机械表或机械全自动表的误差为每日30秒內(次标准为国家部委颁布的)，而石英表的误差较低","格拉苏蒂 Glashütte Original Senator 参议员系列卓越 1-39-59-01-15-04 18k玫瑰金 镶钻","香港组装. 【尺寸】直径：40mm，厚度：9.4mm.适合不同粗细手腕的人佩带的 【颜色】如图显示,背透机芯.金色壳以及银色壳可选择的(见附图) 【机芯】搭载高性能进口机械机芯，存储能量高达48小时 【功能】内部储能很强，长时间不戴依然走时准确。 【表壳】瑞士进口精钢表壳表扣. 【表带】意大利小牛皮真皮表带（可佩鳄鱼皮表带，鳄鱼皮非常昂贵，价格联系客服） 【表面】100%高精度蓝宝石表面,历久如新的.抗磨抗划.正常佩带都是不会有划痕的. 【附件】吊牌说明书;配送专用盒送礼、自带彰显品质. 【保修】非认为损",直径：40mm，厚度：9.4mm.适合不同粗细手腕的人佩带的,,,搭载高性能进口机械机芯，存储能量高达48小时,"100%高精度蓝宝石表面,历久如新的.抗磨抗划.正常佩带都是不会有划痕的.",,"表盘,表背面,表面,表带，表扣等均有原厂""格拉苏蒂""出产标识",内部储能很强，长时间不戴依然走时准确。,吊牌说明书;配送专用盒送礼、自带彰显品质.,"这款豪华格拉苏蒂手表可以使你在日常佩带之时长久保持美观夺目，常带常新；计时准确、造型美观、贴腕设计，质地轻巧、高贵典雅，是现代社会成功人士身份的象征；贴心设计,完全附合你的手腕.",参议员系列,男士手表,真皮表带,圆形表盘,蓝宝石镜面
16,1,"2018-06-21 03:16:00",顶级品牌,16,"2018-06-22 21:40:52","格拉苏蒂 Glashütte Original Senator 参议员系列卓越1-36-01-01-02-01 18k玫瑰金 男士自动机械手表 香港组装",￥2880,￥7200,3106,793,"⊙摆放手表的地方尽量放置干燥剂 ⊙皮质的手表应尽量避免接触到水，以免表带变硬、异味，进而导致断裂的情况。 ⊙手表若发生故障的时候，应立即就近送至专门的钟表店检查。 ⊙机械全自动表必须在活动量足够的情況下，即每日必须佩戴10小时以上，方可正常运转。 ⊙不同的场合应佩戴不同的手表，如运动时选用耐震性优良的运动手表。 ⊙表盖上若无标示有防水能力手表表示其防水程度仅限于无压力下的水花或小雨。 ⊙特別提醒大家，任何手表均不宜在温水或浴室佩戴，哪怕您的手表是防水表，因为手表的密封圈是橡胶，受热容易老化，而且四周的水蒸汽分子比较小，很容易渗入表壳，造成內部机械的损坏。 ⊙由于每种手表的内部机械的构造都不同，在正常的使用状态下，机械表或机械全自动表的误差为每日30秒內(次标准为国家部委颁布的)，而石英表的误差较低","格拉苏蒂 Glashütte Original Senator 参议员系列卓越1-36-01-01-02-01 18k玫瑰金","香港组装. 【尺寸】直径：40mm，厚度：9.4mm.适合不同粗细手腕的人佩带的 【颜色】如图显示,背透机芯.金色壳以及银色壳可选择的(见附图) 【机芯】搭载高性能进口机械机芯，存储能量高达48小时 【功能】内部储能很强，长时间不戴依然走时准确。 【表壳】瑞士进口精钢表壳表扣. 【表带】意大利小牛皮真皮表带（可佩鳄鱼皮表带，鳄鱼皮非常昂贵，价格联系客服） 【表面】100%高精度蓝宝石表面,历久如新的.抗磨抗划.正常佩带都是不会有划痕的. 【附件】吊牌说明书;配送专用盒送礼、自带彰显品质. 【保修】非认为损",直径：40mm，厚度：9.4mm.适合不同粗细手腕的人佩带的,,,搭载高性能进口机械机芯，存储能量高达48小时,"100%高精度蓝宝石表面,历久如新的.抗磨抗划.正常佩带都是不会有划痕的.",,"表盘,表背面,表面,表带，表扣等均有原厂""格拉苏蒂""出产标识",内部储能很强，长时间不戴依然走时准确。,吊牌说明书;配送专用盒送礼、自带彰显品质.,"这款豪华格拉苏蒂手表可以使你在日常佩带之时长久保持美观夺目，常带常新；计时准确、造型美观、贴腕设计，质地轻巧、高贵典雅，是现代社会成功人士身份的象征；贴心设计,完全附合你的手腕.",参议员系列,男士手表,真皮表带,圆形表盘,蓝宝石镜面
17,1,"2018-06-21 03:16:00",顶级品牌,17,"2018-06-22 21:40:54","瑞士卡地亚Cartier男表 18K玫瑰金 蓝气球系列W6900651 皮带全自动机械大号款男士手表 瑞士机芯",￥2480,￥6200,1956,3918,,"瑞士卡地亚Cartier男表 包18K玫瑰金 蓝气球系列W6900651 皮带全自动机械大号款男士手表 瑞士机芯","瑞士配件,香港机组装 【表面】100%的抗磨蓝宝石水晶表面（拱形蓝宝石）与同步;历久如新,抗磨抗划.正常佩带可以保持长久不花.的镜面.品质信誉保证. 【机芯】大型款：瑞士进口ETA2824-2银色雕花专用机芯，支持验货，支持货到付款。 【大小】大号（带日历）直径如图所示：42.1毫米、厚度10毫米，另有号和小号，号：36mm(不带日历)，小号：28mm(不带日历) 【功能】内部储能很强，长时间不戴依然走时准确，带日历，30米防水、防震、防磁.316精钢制作,保证其不掉色;实物拍摄,实物还比其更有质感. 【",,大号（带日历）直径如图所示：42.1毫米、厚度10毫米，另有号和小号，号：36mm(不带日历)，小号：28mm(不带日历),,大型款：瑞士进口ETA2824-2银色雕花专用机芯，支持验货，支持货到付款。,"100%的抗磨蓝宝石水晶表面（拱形蓝宝石）与同步;历久如新,抗磨抗划.正常佩带可以保持长久不花.的镜面.品质信誉保证.",,"表带，表扣,机芯,表面,表按钮等全部有原厂卡地亚标识（更多的细节可通过我们下面附带的图片参考）","内部储能很强，长时间不戴依然走时准确，带日历，30米防水、防震、防磁.316精钢制作,保证其不掉色;实物拍摄,实物还比其更有质感.","配送""卡地亚""专用盒,说明书保修卡识别卡等所有附件齐全，让你无论送礼或者自用都尽显非凡.","这款豪华卡地亚蓝汽球颠峰设计表,可以使你在日常佩带之时长久保持美观夺目，常带常新；计时准确、造型美观、贴腕设计，质地轻巧、高贵典雅，是现代社会成功人士身份的象征；贴心设计,完全附合你的手腕.",蓝气球系列,男士手表,真皮表带,圆形表盘,蓝宝石镜面
18,1,"2018-06-21 03:16:00",顶级品牌,18,"2018-06-22 21:40:54","格拉苏蒂 Glashütte Original Senator 参议员系列卓越1-36-01-01-02-01 男士自动机械手表 香港组装",￥2780,￥6950,1783,1038,"⊙摆放手表的地方尽量放置干燥剂 ⊙皮质的手表应尽量避免接触到水，以免表带变硬、异味，进而导致断裂的情况。 ⊙手表若发生故障的时候，应立即就近送至专门的钟表店检查。 ⊙机械全自动表必须在活动量足够的情況下，即每日必须佩戴10小时以上，方可正常运转。 ⊙不同的场合应佩戴不同的手表，如运动时选用耐震性优良的运动手表。 ⊙表盖上若无标示有防水能力手表表示其防水程度仅限于无压力下的水花或小雨。 ⊙特別提醒大家，任何手表均不宜在温水或浴室佩戴，哪怕您的手表是防水表，因为手表的密封圈是橡胶，受热容易老化，而且四周的水蒸汽分子比较小，很容易渗入表壳，造成內部机械的损坏。 ⊙由于每种手表的内部机械的构造都不同，在正常的使用状态下，机械表或机械全自动表的误差为每日30秒內(次标准为国家部委颁布的)，而石英表的误差较低","格拉苏蒂 Glashütte Original Senator 参议员系列卓越1-36-01-01-02-01","香港组装. 【尺寸】直径：40mm，厚度：9.4mm.适合不同粗细手腕的人佩带的 【颜色】如图显示,背透机芯.金色壳以及银色壳可选择的(见附图) 【机芯】搭载高性能进口机械机芯，存储能量高达48小时 【功能】内部储能很强，长时间不戴依然走时准确。 【表壳】瑞士进口精钢表壳表扣. 【表带】意大利小牛皮真皮表带（可佩鳄鱼皮表带，鳄鱼皮非常昂贵，价格联系客服） 【表面】100%高精度蓝宝石表面,历久如新的.抗磨抗划.正常佩带都是不会有划痕的. 【附件】吊牌说明书;配送专用盒送礼、自带彰显品质. 【保修】非认为损",直径：40mm，厚度：9.4mm.适合不同粗细手腕的人佩带的,,,搭载高性能进口机械机芯，存储能量高达48小时,"100%高精度蓝宝石表面,历久如新的.抗磨抗划.正常佩带都是不会有划痕的.",,"表盘,表背面,表面,表带，表扣等均有原厂""格拉苏蒂""出产标识",内部储能很强，长时间不戴依然走时准确。,吊牌说明书;配送专用盒送礼、自带彰显品质.,"这款豪华格拉苏蒂手表可以使你在日常佩带之时长久保持美观夺目，常带常新；计时准确、造型美观、贴腕设计，质地轻巧、高贵典雅，是现代社会成功人士身份的象征；贴心设计,完全附合你的手腕.",参议员系列,男士手表,真皮表带,圆形表盘,蓝宝石镜面
19,1,"2018-06-21 03:16:00",顶级品牌,19,"2018-06-22 21:40:56","卡地亚Cartier 蓝气球系列W6920083 18K玫瑰金/黄金 白面皮带全自动机械男士手表",￥2680,￥6700,3124,2719,"⊙摆放手表的地方尽量放置干燥剂 ⊙皮质的手表应尽量避免接触到水，以免表带变硬、异味，进而导致断裂的情况。 ⊙手表若发生故障的时候，应立即就近送至专门的钟表店检查。 ⊙机械全自动表必须在活动量足够的情況下，即每日必须佩戴10小时以上，方可正常运转。 ⊙不同的场合应佩戴不同的手表，如运动时选用耐震性优良的运动手表。 ⊙表盖上若无标示有防水能力手表表示其防水程度仅限于无压力下的水花或小雨。 ⊙特別提醒大家，任何手表均不宜在温水或浴室佩戴，哪怕您的手表是防水表，因为手表的密封圈是橡胶，受热容易老化，而且四周的水蒸汽分子比较小，很容易渗入表壳，造成內部机械的损坏。 ⊙由于每种手表的内部机械的构造都不同，在正常的使用状态下，机械表或机械全自动表的误差为每日30秒內(次标准为国家部委颁布的)，而石英表的误差较低也比较准确","【卡地亚W6920083】一比一精仿卡地亚Cartier 蓝气球系列W6920083 包18K玫瑰金/黄金 白面皮带全自动机械男士手表 【产地】香港机组装","香港机组装 【表面】100%的抗磨蓝宝石水晶表面（拱形蓝宝石）与同步;历久如新,抗磨抗划.正常佩带可以保持长久不花.的镜面.品质信誉保证. 【机芯】进口9015银色雕花专用机芯，走时精准稳定。 【大小】男款直径：40毫米，厚度：7.05毫米 【功能】内部储能很强，长时间不戴依然走时准确，30米防水、防震、防磁. 【表带】精湛工艺.典雅休闲，不掉色，配卡地亚专用扣。 【表壳】瑞士进口316L精钢或包包18K玫瑰金表壳,打磨抛光精湛工艺.不掉色。 【保修】非人为损坏自购买起三年免费保修,终身成本保修; 【附件",,男款直径：40毫米，厚度：7.05毫米,,进口9015银色雕花专用机芯，走时精准稳定。,"100%的抗磨蓝宝石水晶表面（拱形蓝宝石）与同步;历久如新,抗磨抗划.正常佩带可以保持长久不花.的镜面.品质信誉保证.",,"表带，表扣,机芯,表面,表按钮等全部有原厂卡地亚标识（更多的细节可通过我们下面附带的图片参考）",内部储能很强，长时间不戴依然走时准确，30米防水、防震、防磁.,"配送""卡地亚""专用盒,说明书保修卡识别卡等所有附件齐全，让你无论送礼或者自用都尽显非凡.","这款豪华卡地亚蓝汽球颠峰设计表,可以使你在日常佩带之时长久保持美观夺目，常带常新；计时准确、造型美观、贴腕设计，质地轻巧、高贵典雅，是现代社会成功人士身份的象征；贴心设计,完全附合你的手腕.",蓝气球系列,男士手表,真皮表带,圆形表盘,蓝宝石镜面
20,1,"2018-06-21 03:16:00",顶级品牌,20,"2018-06-22 21:40:57","爱彼 Ap Diver 皇家橡树离岸型系列 Royal Oak Offshore 潜水计时码表 Ref# 26703ST.OO.A027CA.01（夏季必备，代表“蓝莓”）",￥3980,￥9950,1735,1245,"⊙摆放手表的地方尽量放置干燥剂 ⊙皮质的手表应尽量避免接触到水，以免表带变硬、异味，进而导致断裂的情况。 ⊙手表若发生故障的时候，应立即就近送至专门的钟表店检查。 ⊙机械全自动表必须在活动量足够的情況下，即每日必须佩戴10小时以上，方可正常运转。 ⊙不同的场合应佩戴不同的手表，如运动时选用耐震性优良的运动手表。 ⊙表盖上若无标示有防水能力手表表示其防水程度仅限于无压力下的水花或小雨。 ⊙特別提醒大家，任何手表均不宜在温水或浴室佩戴，哪怕您的手表是防水表，因为手表的密封圈是橡胶，受热容易老化，而且四周的水蒸汽分子比较小，很容易渗入表壳，造成內部机械的损坏。 ⊙由于每种手表的内部机械的构造都不同，在正常的使用状态下，机械表或机械全自动表的误差为每日30秒內(次标准为国家部委颁布的)，而石英表的误差较低也比较准确 从未与本店沟通，擅自作出差评，并取消一切售后服务！！！","爱彼 Ap Diver 皇家橡树离岸型系列 Royal Oak Offshore 潜水计时码表 Ref# 26703ST.OO.A027CA.01",香港组装,,直径如图所示：42MM、厚度14.75MM；,,定制版3120机自动机械机芯。,"100%的抗磨蓝宝石水晶表面（拱形蓝宝石）与同步;历久如新,抗磨抗划.正常佩带可以保持长久不花.的镜面.品质信誉保证.",,"表带，表扣,机芯,表面,表按钮等全部有原厂爱彼标识（更多的细节可通过我们下面附带的图片参考）","内部储能很强，长时间不戴依然走时准确，带日历，>50米防水、防震、防磁.316精钢制作,保证其不掉色;实物拍摄,实物还比其更有质感.","配送""爱彼""专用盒,说明书保修卡识别卡等所有附件齐全，让你无论送礼或者自用都尽显非凡.","这款豪华爱彼颠峰设计表,可以使你在日常佩带之时长久保持美观夺目，常带常新；计时准确、造型美观、贴腕设计，质地轻巧、高贵典雅，是现代社会成功人士身份的象征；贴心设计,完全附合你的手腕.",皇家橡树离岸型,男士手表,橡胶表带,圆形表盘,蓝宝石镜面
21,1,"2018-06-21 03:16:00",顶级品牌,21,"2018-06-22 21:41:00","江诗丹顿Vacheron Constantin传承系列85180/000R-9166 18K玫瑰金 黑面 男士自动机械腕表",￥2780,￥6950,1435,2548,,"【江诗丹顿85180/000R-9166】江诗丹顿Vacheron Constantin传承系列85180/000R-9166 包18K玫瑰金 黑面 男士自动机械腕表","香港组装 【尺寸】直径40毫米、厚度：11MM;男款大数字刻度,适合不同粗细手腕的人佩带. 【颜色】如图显示 【机芯】搭载进口高性能改Cal.2450 sc机械机芯.可长时间精确走时,存储高度能量. 【功能】防水、防震、防磁;精致的阿拉伯经典刻度,指针独特设计,带日历,尽显示你的高贵气质,,优雅首选;背透,全新多功能机芯清晰可见. 【表壳】精钢纯钢表壳,实物拍摄,实物还比图片更有质感的. 【表带】进口设计专用真皮表带,搭配十字花式表扣 【表面】100%高精度蓝宝石表面,历久如新的.抗磨抗划.正常佩带都是不","直径40毫米、厚度：11MM;男款大数字刻度,适合不同粗细手腕的人佩带.",,,"搭载进口高性能改Cal.2450 sc机械机芯.可长时间精确走时,存储高度能量.","100%高精度蓝宝石表面,历久如新的.抗磨抗划.正常佩带都是不会有划痕的.",,"表盘,表背面,表面,表带，表扣等均有VC出产标识","防水、防震、防磁;精致的阿拉伯经典刻度,指针独特设计,带日历,尽显示你的高贵气质,,优雅首选;背透,全新多功能机芯清晰可见.","吊牌说明书;配送""江诗""专用盒送礼、自带彰显品质.","这款豪华江诗丹顿VACHERON CONSTANTIN手表可以使你在日常佩带之时长久保持美观夺目，常带常新；计时准确、造型美观、贴腕设计，质地轻巧、高贵典雅，是现代社会成功人士身份的象征；贴心设计,完全附合你的手腕",传承系列,男士手表,真皮表带,圆形表盘,蓝宝石镜面
22,1,"2018-06-21 03:16:00",顶级品牌,22,"2018-06-22 21:41:04","瑞士江诗丹顿Vacheron Constantin传承系列85180/000R-9248 18K玫瑰金男士自动机械腕表",￥2780,￥6950,1693,4432,,"【江诗丹顿85180/000R-9248】一比一高精仿瑞士江诗丹顿Vacheron Constantin传承系列85180/000R-9248 包18K玫瑰金男士自动机械腕表","香港组装 【尺寸】直径40毫米、厚度：11MM;男款大数字刻度,适合不同粗细手腕的人佩带. 【颜色】如图显示 【机芯】搭载进口高性能改Cal.2450 sc机械机芯.可长时间精确走时,存储高度能量. 【功能】防水、防震、防磁;精致的阿拉伯经典刻度,指针独特设计,带日历,尽显示你的高贵气质,,优雅首选;背透,全新多功能机芯清晰可见.   【表壳】精钢纯钢表壳,实物拍摄,实物还比图片更有质感的. 【表带】进口设计专用真皮表带,搭配十字花式表扣 【表面】100%高精度蓝宝石表面,历久如新的.抗磨抗划.正常佩带都","直径40毫米、厚度：11MM;男款大数字刻度,适合不同粗细手腕的人佩带.",,,"搭载进口高性能改Cal.2450 sc机械机芯.可长时间精确走时,存储高度能量.","100%高精度蓝宝石表面,历久如新的.抗磨抗划.正常佩带都是不会有划痕的.",,"表盘,表背面,表面,表带，表扣等均有VC出产标识","防水、防震、防磁;精致的阿拉伯经典刻度,指针独特设计,带日历,尽显示你的高贵气质,,优雅首选;背透,全新多功能机芯清晰可见.  ","吊牌说明书;配送""江诗""专用盒送礼、自带彰显品质.","这款豪华江诗丹顿VACHERON CONSTANTIN手表可以使你在日常佩带之时长久保持美观夺目，常带常新；计时准确、造型美观、贴腕设计，质地轻巧、高贵典雅，是现代社会成功人士身份的象征；贴心设计,完全附合你的手腕",传承系列,男士手表,真皮表带,圆形表盘,蓝宝石镜面
23,1,"2018-06-21 03:16:00",顶级品牌,23,"2018-06-22 21:41:08","瑞士江诗丹顿Vacheron Constantin传承系列85180/000J-9231 18K金男士自动机械腕表",￥2780,￥6950,1523,2011,,"瑞士江诗丹顿Vacheron Constantin传承系列85180/000J-9231 包18K金","香港组装 【尺寸】直径40毫米、厚度：11MM;男款大数字刻度,适合不同粗细手腕的人佩带. 【颜色】如图显示 【机芯】搭载进口高性能改Cal.2450 sc机械机芯.可长时间精确走时,存储高度能量. 【功能】防水、防震、防磁;精致的阿拉伯经典刻度,指针独特设计,带日历,尽显示你的高贵气质,,优雅首选;背透,全新多功能机芯清晰可见. 【表壳】精钢纯钢表壳,实物拍摄,实物还比图片更有质感的. 【表带】进口设计专用真皮表带,搭配十字花式表扣 【表面】100%高精度蓝宝石表面,历久如新的.抗磨抗划.正常佩带都是不","直径40毫米、厚度：11MM;男款大数字刻度,适合不同粗细手腕的人佩带.",,,"搭载进口高性能改Cal.2450 sc机械机芯.可长时间精确走时,存储高度能量.","100%高精度蓝宝石表面,历久如新的.抗磨抗划.正常佩带都是不会有划痕的.",,"表盘,表背面,表面,表带，表扣等均有VC出产标识","防水、防震、防磁;精致的阿拉伯经典刻度,指针独特设计,带日历,尽显示你的高贵气质,,优雅首选;背透,全新多功能机芯清晰可见.","吊牌说明书;配送""江诗""专用盒送礼、自带彰显品质.","这款豪华江诗丹顿VACHERON CONSTANTIN手表可以使你在日常佩带之时长久保持美观夺目，常带常新；计时准确、造型美观、贴腕设计，质地轻巧、高贵典雅，是现代社会成功人士身份的象征；贴心设计,完全附合你的手腕",传承系列,男士手表,真皮表带,圆形表盘,蓝宝石镜面